Модераторы: Sardar, Aliance
  

Поиск:

Ответ в темуСоздание новой темы Создание опроса
> Не собирается apk в React Native, Task :app:mergeReleaseResources FAILED 
:(
    Опции темы
kaktebe
Дата 20.2.2020, 15:08 (ссылка) | (нет голосов) Загрузка ... Загрузка ... Быстрая цитата Цитата


Новичок



Профиль
Группа: Участник
Сообщений: 49
Регистрация: 23.1.2012

Репутация: нет
Всего: нет



Начал изучать React Native. Создал проект такой командой:
Код

react-native init rnapp

Проект создался, но выдал кучу сообщений:
Код

npm notice created a lockfile as package-lock.json. You should commit this file.
npm WARN optional SKIPPING OPTIONAL DEPENDENCY: [email protected]^1.2.7 (node_modules\jest-haste-map\node_modules\fsevents):
npm WARN notsup SKIPPING OPTIONAL DEPENDENCY: Unsupported platform for [email protected]: wanted {"os":"darwin","arch":"any"} (current: {"os":"win32","a
rch":"x64"})
npm WARN [email protected] requires a peer of [email protected] but none is installed. You must install peer dependencies yourself.
npm WARN optional SKIPPING OPTIONAL DEPENDENCY: [email protected] (node_modules\fsevents\node_modules\abbrev):
npm WARN enoent SKIPPING OPTIONAL DEPENDENCY: ENOENT: no such file or directory, rename 'D:\rnapp\node_modules\fsevents\node_modules\abbrev' -> 'D:\rn
app\node_modules\fsevents\node_modules\.abbrev.DELETE'
npm WARN optional SKIPPING OPTIONAL DEPENDENCY: [email protected] (node_modules\fsevents\node_modules\ansi-regex):
npm WARN enoent SKIPPING OPTIONAL DEPENDENCY: ENOENT: no such file or directory, rename 'D:\rnapp\node_modules\fsevents\node_modules\ansi-regex' -> 'D
:\rnapp\node_modules\fsevents\node_modules\.ansi-regex.DELETE'
npm WARN optional SKIPPING OPTIONAL DEPENDENCY: [email protected] (node_modules\fsevents\node_modules\aproba):
npm WARN enoent SKIPPING OPTIONAL DEPENDENCY: ENOENT: no such file or directory, rename 'D:\rnapp\node_modules\fsevents\node_modules\aproba' -> 'D:\rn
app\node_modules\fsevents\node_modules\.aproba.DELETE'
npm WARN optional SKIPPING OPTIONAL DEPENDENCY: [email protected] (node_modules\fsevents\node_modules\balanced-match):
npm WARN enoent SKIPPING OPTIONAL DEPENDENCY: ENOENT: no such file or directory, rename 'D:\rnapp\node_modules\fsevents\node_modules\balanced-match' -
> 'D:\rnapp\node_modules\fsevents\node_modules\.balanced-match.DELETE'
npm WARN optional SKIPPING OPTIONAL DEPENDENCY: [email protected] (node_modules\fsevents\node_modules\chownr):
npm WARN enoent SKIPPING OPTIONAL DEPENDENCY: ENOENT: no such file or directory, rename 'D:\rnapp\node_modules\fsevents\node_modules\chownr' -> 'D:\rn
app\node_modules\fsevents\node_modules\.chownr.DELETE'
npm WARN optional SKIPPING OPTIONAL DEPENDENCY: [email protected] (node_modules\fsevents\node_modules\code-point-at):
npm WARN enoent SKIPPING OPTIONAL DEPENDENCY: ENOENT: no such file or directory, rename 'D:\rnapp\node_modules\fsevents\node_modules\code-point-at' ->
 'D:\rnapp\node_modules\fsevents\node_modules\.code-point-at.DELETE'
npm WARN optional SKIPPING OPTIONAL DEPENDENCY: [email protected] (node_modules\fsevents\node_modules\concat-map):
npm WARN enoent SKIPPING OPTIONAL DEPENDENCY: ENOENT: no such file or directory, rename 'D:\rnapp\node_modules\fsevents\node_modules\concat-map' -> 'D
:\rnapp\node_modules\fsevents\node_modules\.concat-map.DELETE'
npm WARN optional SKIPPING OPTIONAL DEPENDENCY: [email protected] (node_modules\fsevents\node_modules\console-control-strings):
npm WARN enoent SKIPPING OPTIONAL DEPENDENCY: ENOENT: no such file or directory, rename 'D:\rnapp\node_modules\fsevents\node_modules\console-control-s
trings' -> 'D:\rnapp\node_modules\fsevents\node_modules\.console-control-strings.DELETE'
npm WARN optional SKIPPING OPTIONAL DEPENDENCY: [email protected] (node_modules\fsevents\node_modules\core-util-is):
npm WARN enoent SKIPPING OPTIONAL DEPENDENCY: ENOENT: no such file or directory, rename 'D:\rnapp\node_modules\fsevents\node_modules\core-util-is' ->
'D:\rnapp\node_modules\fsevents\node_modules\.core-util-is.DELETE'
npm WARN optional SKIPPING OPTIONAL DEPENDENCY: [email protected] (node_modules\fsevents\node_modules\deep-extend):
npm WARN enoent SKIPPING OPTIONAL DEPENDENCY: ENOENT: no such file or directory, rename 'D:\rnapp\node_modules\fsevents\node_modules\deep-extend' -> '
D:\rnapp\node_modules\fsevents\node_modules\.deep-extend.DELETE'
npm WARN optional SKIPPING OPTIONAL DEPENDENCY: [email protected] (node_modules\fsevents\node_modules\delegates):
npm WARN enoent SKIPPING OPTIONAL DEPENDENCY: ENOENT: no such file or directory, rename 'D:\rnapp\node_modules\fsevents\node_modules\delegates' -> 'D:
\rnapp\node_modules\fsevents\node_modules\.delegates.DELETE'
npm WARN optional SKIPPING OPTIONAL DEPENDENCY: [email protected] (node_modules\fsevents\node_modules\detect-libc):
npm WARN enoent SKIPPING OPTIONAL DEPENDENCY: ENOENT: no such file or directory, rename 'D:\rnapp\node_modules\fsevents\node_modules\detect-libc' -> '
D:\rnapp\node_modules\fsevents\node_modules\.detect-libc.DELETE'
npm WARN optional SKIPPING OPTIONAL DEPENDENCY: [email protected] (node_modules\fsevents\node_modules\fs.realpath):
npm WARN enoent SKIPPING OPTIONAL DEPENDENCY: ENOENT: no such file or directory, rename 'D:\rnapp\node_modules\fsevents\node_modules\fs.realpath' -> '
D:\rnapp\node_modules\fsevents\node_modules\.fs.realpath.DELETE'
npm WARN optional SKIPPING OPTIONAL DEPENDENCY: [email protected] (node_modules\fsevents\node_modules\has-unicode):
npm WARN enoent SKIPPING OPTIONAL DEPENDENCY: ENOENT: no such file or directory, rename 'D:\rnapp\node_modules\fsevents\node_modules\has-unicode' -> '
D:\rnapp\node_modules\fsevents\node_modules\.has-unicode.DELETE'
npm WARN optional SKIPPING OPTIONAL DEPENDENCY: [email protected] (node_modules\fsevents\node_modules\inherits):
npm WARN enoent SKIPPING OPTIONAL DEPENDENCY: ENOENT: no such file or directory, rename 'D:\rnapp\node_modules\fsevents\node_modules\inherits' -> 'D:\
rnapp\node_modules\fsevents\node_modules\.inherits.DELETE'
npm WARN optional SKIPPING OPTIONAL DEPENDENCY: [email protected] (node_modules\fsevents\node_modules\ini):
npm WARN enoent SKIPPING OPTIONAL DEPENDENCY: ENOENT: no such file or directory, rename 'D:\rnapp\node_modules\fsevents\node_modules\ini' -> 'D:\rnapp
\node_modules\fsevents\node_modules\.ini.DELETE'
npm WARN optional SKIPPING OPTIONAL DEPENDENCY: [email protected] (node_modules\fsevents\node_modules\isarray):
npm WARN enoent SKIPPING OPTIONAL DEPENDENCY: ENOENT: no such file or directory, rename 'D:\rnapp\node_modules\fsevents\node_modules\isarray' -> 'D:\r
napp\node_modules\fsevents\node_modules\.isarray.DELETE'
npm WARN optional SKIPPING OPTIONAL DEPENDENCY: [email protected] (node_modules\fsevents\node_modules\minimist):
npm WARN enoent SKIPPING OPTIONAL DEPENDENCY: ENOENT: no such file or directory, rename 'D:\rnapp\node_modules\fsevents\node_modules\minimist' -> 'D:\
rnapp\node_modules\fsevents\node_modules\.minimist.DELETE'
npm WARN optional SKIPPING OPTIONAL DEPENDENCY: [email protected] (node_modules\fsevents\node_modules\ms):
npm WARN enoent SKIPPING OPTIONAL DEPENDENCY: ENOENT: no such file or directory, rename 'D:\rnapp\node_modules\fsevents\node_modules\ms' -> 'D:\rnapp\
node_modules\fsevents\node_modules\.ms.DELETE'
npm WARN optional SKIPPING OPTIONAL DEPENDENCY: [email protected] (node_modules\fsevents\node_modules\npm-normalize-package-bin):
npm WARN enoent SKIPPING OPTIONAL DEPENDENCY: ENOENT: no such file or directory, rename 'D:\rnapp\node_modules\fsevents\node_modules\npm-normalize-pac
kage-bin' -> 'D:\rnapp\node_modules\fsevents\node_modules\.npm-normalize-package-bin.DELETE'
npm WARN optional SKIPPING OPTIONAL DEPENDENCY: [email protected] (node_modules\fsevents\node_modules\number-is-nan):
npm WARN enoent SKIPPING OPTIONAL DEPENDENCY: ENOENT: no such file or directory, rename 'D:\rnapp\node_modules\fsevents\node_modules\number-is-nan' ->
 'D:\rnapp\node_modules\fsevents\node_modules\.number-is-nan.DELETE'
npm WARN optional SKIPPING OPTIONAL DEPENDENCY: [email protected] (node_modules\fsevents\node_modules\object-assign):
npm WARN enoent SKIPPING OPTIONAL DEPENDENCY: ENOENT: no such file or directory, rename 'D:\rnapp\node_modules\fsevents\node_modules\object-assign' ->
 'D:\rnapp\node_modules\fsevents\node_modules\.object-assign.DELETE'
npm WARN optional SKIPPING OPTIONAL DEPENDENCY: [email protected] (node_modules\fsevents\node_modules\os-homedir):
npm WARN enoent SKIPPING OPTIONAL DEPENDENCY: ENOENT: no such file or directory, rename 'D:\rnapp\node_modules\fsevents\node_modules\os-homedir' -> 'D
:\rnapp\node_modules\fsevents\node_modules\.os-homedir.DELETE'
npm WARN optional SKIPPING OPTIONAL DEPENDENCY: [email protected] (node_modules\fsevents\node_modules\os-tmpdir):
npm WARN enoent SKIPPING OPTIONAL DEPENDENCY: ENOENT: no such file or directory, rename 'D:\rnapp\node_modules\fsevents\node_modules\os-tmpdir' -> 'D:
\rnapp\node_modules\fsevents\node_modules\.os-tmpdir.DELETE'
npm WARN optional SKIPPING OPTIONAL DEPENDENCY: [email protected] (node_modules\fsevents\node_modules\path-is-absolute):
npm WARN enoent SKIPPING OPTIONAL DEPENDENCY: ENOENT: no such file or directory, rename 'D:\rnapp\node_modules\fsevents\node_modules\path-is-absolute'
 -> 'D:\rnapp\node_modules\fsevents\node_modules\.path-is-absolute.DELETE'
npm WARN optional SKIPPING OPTIONAL DEPENDENCY: [email protected] (node_modules\fsevents\node_modules\process-nextick-args):
npm WARN enoent SKIPPING OPTIONAL DEPENDENCY: ENOENT: no such file or directory, rename 'D:\rnapp\node_modules\fsevents\node_modules\process-nextick-a
rgs' -> 'D:\rnapp\node_modules\fsevents\node_modules\.process-nextick-args.DELETE'
npm WARN optional SKIPPING OPTIONAL DEPENDENCY: [email protected] (node_modules\fsevents\node_modules\rc\node_modules\minimist):
npm WARN enoent SKIPPING OPTIONAL DEPENDENCY: ENOENT: no such file or directory, rename 'D:\rnapp\node_modules\fsevents\node_modules\rc\node_modules\m
inimist' -> 'D:\rnapp\node_modules\fsevents\node_modules\rc\node_modules\.minimist.DELETE'
npm WARN optional SKIPPING OPTIONAL DEPENDENCY: [email protected] (node_modules\fsevents\node_modules\safe-buffer):
npm WARN enoent SKIPPING OPTIONAL DEPENDENCY: ENOENT: no such file or directory, rename 'D:\rnapp\node_modules\fsevents\node_modules\safe-buffer' -> '
D:\rnapp\node_modules\fsevents\node_modules\.safe-buffer.DELETE'
npm WARN optional SKIPPING OPTIONAL DEPENDENCY: [email protected] (node_modules\fsevents\node_modules\safer-buffer):
npm WARN enoent SKIPPING OPTIONAL DEPENDENCY: ENOENT: no such file or directory, rename 'D:\rnapp\node_modules\fsevents\node_modules\safer-buffer' ->
'D:\rnapp\node_modules\fsevents\node_modules\.safer-buffer.DELETE'
npm WARN optional SKIPPING OPTIONAL DEPENDENCY: [email protected] (node_modules\fsevents\node_modules\sax):
npm WARN enoent SKIPPING OPTIONAL DEPENDENCY: ENOENT: no such file or directory, rename 'D:\rnapp\node_modules\fsevents\node_modules\sax' -> 'D:\rnapp
\node_modules\fsevents\node_modules\.sax.DELETE'
npm WARN optional SKIPPING OPTIONAL DEPENDENCY: [email protected] (node_modules\fsevents\node_modules\semver):
npm WARN enoent SKIPPING OPTIONAL DEPENDENCY: ENOENT: no such file or directory, rename 'D:\rnapp\node_modules\fsevents\node_modules\semver' -> 'D:\rn
app\node_modules\fsevents\node_modules\.semver.DELETE'
npm WARN optional SKIPPING OPTIONAL DEPENDENCY: [email protected] (node_modules\fsevents\node_modules\set-blocking):
npm WARN enoent SKIPPING OPTIONAL DEPENDENCY: ENOENT: no such file or directory, rename 'D:\rnapp\node_modules\fsevents\node_modules\set-blocking' ->
'D:\rnapp\node_modules\fsevents\node_modules\.set-blocking.DELETE'
npm WARN optional SKIPPING OPTIONAL DEPENDENCY: [email protected] (node_modules\fsevents\node_modules\signal-exit):
npm WARN enoent SKIPPING OPTIONAL DEPENDENCY: ENOENT: no such file or directory, rename 'D:\rnapp\node_modules\fsevents\node_modules\signal-exit' -> '
D:\rnapp\node_modules\fsevents\node_modules\.signal-exit.DELETE'
npm WARN optional SKIPPING OPTIONAL DEPENDENCY: [email protected] (node_modules\fsevents\node_modules\strip-json-comments):
npm WARN enoent SKIPPING OPTIONAL DEPENDENCY: ENOENT: no such file or directory, rename 'D:\rnapp\node_modules\fsevents\node_modules\strip-json-commen
ts' -> 'D:\rnapp\node_modules\fsevents\node_modules\.strip-json-comments.DELETE'
npm WARN optional SKIPPING OPTIONAL DEPENDENCY: [email protected] (node_modules\fsevents\node_modules\util-deprecate):
npm WARN enoent SKIPPING OPTIONAL DEPENDENCY: ENOENT: no such file or directory, rename 'D:\rnapp\node_modules\fsevents\node_modules\util-deprecate' -
> 'D:\rnapp\node_modules\fsevents\node_modules\.util-deprecate.DELETE'
npm WARN optional SKIPPING OPTIONAL DEPENDENCY: [email protected] (node_modules\fsevents\node_modules\wrappy):
npm WARN enoent SKIPPING OPTIONAL DEPENDENCY: ENOENT: no such file or directory, rename 'D:\rnapp\node_modules\fsevents\node_modules\wrappy' -> 'D:\rn
app\node_modules\fsevents\node_modules\.wrappy.DELETE'
npm WARN optional SKIPPING OPTIONAL DEPENDENCY: [email protected] (node_modules\fsevents\node_modules\yallist):
npm WARN enoent SKIPPING OPTIONAL DEPENDENCY: ENOENT: no such file or directory, rename 'D:\rnapp\node_modules\fsevents\node_modules\yallist' -> 'D:\r
napp\node_modules\fsevents\node_modules\.yallist.DELETE'

+ [email protected]
added 661 packages from 422 contributors and audited 66264 packages in 105.043s

6 packages are looking for funding
  run `npm fund` for details

found 4 low severity vulnerabilities
  run `npm audit fix` to fix them, or `npm audit` for details
info Setting up new React Native app in D:\rnapp
info Adding required dependencies
npm WARN optional SKIPPING OPTIONAL DEPENDENCY: [email protected] (node_modules\fsevents):
npm WARN notsup SKIPPING OPTIONAL DEPENDENCY: Unsupported platform for [email protected]: wanted {"os":"darwin","arch":"any"} (current: {"os":"win32","a
rch":"x64"})

+ [email protected]
added 1 package and audited 67263 packages in 12.889s

6 packages are looking for funding
  run `npm fund` for details

found 4 low severity vulnerabilities
  run `npm audit fix` to fix them, or `npm audit` for details
info Adding required dev dependencies
npm WARN deprecated [email protected]: use String.prototype.padStart()
npm WARN deprecated [email protected]: request has been deprecated, see https://github.com/request/request/issues/3142
npm WARN [email protected] requires a peer of [email protected]^3.17.0 || ^4 || ^5 but none is installed. You must install peer dependencies your
self.
npm WARN [email protected] requires a peer of [email protected]^3.0.0 || ^4.0.0 || ^5.0.0 but none is installed. You must install peer dependencies you
rself.
npm WARN @typescript-eslint/[email protected] requires a peer of [email protected]^5.0.0 but none is installed. You must install peer dependencies yourself.
npm WARN @typescript-eslint/[email protected] requires a peer of [email protected]^5.0.0 but none is installed. You must install peer dependencies yourself.
npm WARN [email protected] requires a peer of [email protected]>=2.8.0 || >= 3.2.0-dev || >= 3.3.0-dev || >= 3.4.0-dev || >= 3.5.0-dev || >= 3.6.0-dev || >= 3.
6.0-beta || >= 3.7.0-dev || >= 3.7.0-beta but none is installed. You must install peer dependencies yourself.
npm WARN optional SKIPPING OPTIONAL DEPENDENCY: [email protected] (node_modules\fsevents):
npm WARN notsup SKIPPING OPTIONAL DEPENDENCY: Unsupported platform for [email protected]: wanted {"os":"darwin","arch":"any"} (current: {"os":"win32","a
rch":"x64"})

Зашёл в папку android проекта и ввёл:
Код

gradlew assemblerelease

И получаю такой результат:
Код

> Task :app:bundleReleaseJsAndAssets
warning: the transform cache was reset.
Loading dependency graph, done.
info Writing bundle output to:, D:\rnapp\android\app\build\generated\assets\react\release\index.android.bundle
info Writing sourcemap output to:, D:\rnapp\android\app\build\generated\sourcemaps\react\release\index.android.bundle.map
info Done writing sourcemap output
info Done writing bundle output
info Copying 2 asset files
info Done copying assets

> Task :app:mergeReleaseResources FAILED

FAILURE: Build failed with an exception.

* What went wrong:
Execution failed for task ':app:mergeReleaseResources'.
> 8 exceptions were raised by workers:
  com.android.builder.internal.aapt.v2.Aapt2InternalException: AAPT2 aapt2-3.4.2-5326820-windows Daemon #0: Daemon startup failed
  This should not happen under normal circumstances, please file an issue if it does.
  com.android.builder.internal.aapt.v2.Aapt2InternalException: AAPT2 aapt2-3.4.2-5326820-windows Daemon #1: Daemon startup failed
  This should not happen under normal circumstances, please file an issue if it does.
  com.android.builder.internal.aapt.v2.Aapt2InternalException: AAPT2 aapt2-3.4.2-5326820-windows Daemon #2: Daemon startup failed
  This should not happen under normal circumstances, please file an issue if it does.
  com.android.builder.internal.aapt.v2.Aapt2InternalException: AAPT2 aapt2-3.4.2-5326820-windows Daemon #3: Daemon startup failed
  This should not happen under normal circumstances, please file an issue if it does.
  com.android.builder.internal.aapt.v2.Aapt2InternalException: AAPT2 aapt2-3.4.2-5326820-windows Daemon #4: Daemon startup failed
  This should not happen under normal circumstances, please file an issue if it does.
  com.android.builder.internal.aapt.v2.Aapt2InternalException: AAPT2 aapt2-3.4.2-5326820-windows Daemon #5: Daemon startup failed
  This should not happen under normal circumstances, please file an issue if it does.
  com.android.builder.internal.aapt.v2.Aapt2InternalException: AAPT2 aapt2-3.4.2-5326820-windows Daemon #6: Daemon startup failed
  This should not happen under normal circumstances, please file an issue if it does.
  com.android.builder.internal.aapt.v2.Aapt2InternalException: AAPT2 aapt2-3.4.2-5326820-windows Daemon #7: Daemon startup failed
  This should not happen under normal circumstances, please file an issue if it does.


* Try:
Run with --stacktrace option to get the stack trace. Run with --info or --debug option to get more log output. Run with --scan to get full insights.

* Get more help at https://help.gradle.org

BUILD FAILED in 3m 37s
10 actionable tasks: 10 executed

Кто-нибудь знает из-за чего так и как это исправить?

Это сообщение отредактировал(а) kaktebe - 20.2.2020, 15:09
PM MAIL   Вверх
  
Ответ в темуСоздание новой темы Создание опроса
1 Пользователей читают эту тему (1 Гостей и 0 Скрытых Пользователей)
0 Пользователей:
« Предыдущая тема | JavaScript: Применение библиотек | Следующая тема »


 




[ Время генерации скрипта: 0.0930 ]   [ Использовано запросов: 21 ]   [ GZIP включён ]


Реклама на сайте     Информационное спонсорство

 
По вопросам размещения рекламы пишите на vladimir(sobaka)vingrad.ru
Отказ от ответственности     Powered by Invision Power Board(R) 1.3 © 2003  IPS, Inc.