
Создатель
  
Профиль
Группа: Завсегдатай
Сообщений: 1262
Регистрация: 14.2.2006
Где: Москва
Репутация: нет Всего: 8
|
Ну что там интересного? | Код | [root@ServerL1 install]# cd ~/install [root@ServerL1 install]# rpm -ihv FirebirdSS-2.1.0.17755-ReleaseCandidate2.i686.rpm Подготовка... ########################################### [100%] 1:FirebirdSS ########################################### [100%] Starting Firebird server [default] server has been successfully started [ OK ] [root@ServerL1 lib]# ln libfbclient.so.2.1.0 /lib/libfbclient.so.2 [root@ServerL1 lib]# ln libfbclient.so.2.1.0 /usr/lib/libfbclient.so.2 [root@ServerL1 install]# cat /opt/firebird/SYSDBA.password # Firebird generated password for user SYSDBA is:
ISC_USER=sysdba ISC_PASSWD=Ufa6kBPh
# generated on ServerL1.foton at time Срд Мар 26 11:07:11 MSK 2008
# Your password can be changed to a more suitable one using the # /opt/firebird/bin/changeDBAPassword.sh script
[root@ServerL1 install]# mkdir /opt/firebird/bases;chown firebird /opt/firebird/bases [root@ServerL1 bin]# cd /opt/firebird/bin;./isql Use CONNECT or CREATE DATABASE to specify a database SQL> SET SQL DIALECT 3; SQL> SET NAMES WIN1251; SQL> CREATE DATABASE '/opt/firebird/bases/TEST' USER 'sysdba' PASSWORD 'Ufa6kBPh' PAGE_SIZE 16384 DEFAULT CHARACTER SET WIN1251; CON> QUIT;
[root@ServerL1 install]# cd ~/install;tar -xf DBD-InterBase-0.48.tar;cd DBD-InterBase-0.48;ls blib dbdimp.o InterBase.o lib META.yml t Changes InterBase.bs InterBase.pm Makefile PatchBCC typemap dbdimp.c InterBase.c InterBase.xs Makefile.PL pm_to_blib dbdimp.h InterBase.h InterBase.xsi MANIFEST README
[root@ServerL1 install]# perl Makefile.PL InterBase/Firebird bin directory : [/opt/firebird/bin] InterBase/Firebird include directory : [/opt/firebird/include] InterBase/Firebird lib directory : [/opt/firebird/lib]
Reading cached test configuration... Full path to your test database: [/opt/firebird/bases/TEST] /opt/firebird/bases/TEST exists. Trying to use an existing database.. Please enter a username to connect. Username : [sysdba] Password : [zNS87ura] Ufa6kBPh Using DBI 1.602 (for perl 5.008008 on i386-linux-thread-multi) installed in /usr/lib/perl5/site_perl/5.8.8/i386-linux-thread-multi/auto/DBI/ Writing Makefile for DBD::InterBase
[root@ServerL1 install]# make gcc -c -I"/opt/firebird/include" -I"/usr/lib/perl5/site_perl/5.8.8/i386-linux-thread-multi/auto/DBI" -Wall -fno-strict-aliasing -O2 -g -pipe -Wall -Wp,-D_FORTIFY_SOURCE=2 -fexceptions -fstack-protector --param=ssp-buffer-size=4 -m32 -march=i386 -mtune=generic -fasynchronous-unwind-tables -DVERSION=\"0.48\" -DXS_VERSION=\"0.48\" -fPIC "-I/usr/lib/perl5/5.8.8/i386-linux-thread-multi/CORE" InterBase.c gcc -c -I"/opt/firebird/include" -I"/usr/lib/perl5/site_perl/5.8.8/i386-linux-thread-multi/auto/DBI" -Wall -fno-strict-aliasing -O2 -g -pipe -Wall -Wp,-D_FORTIFY_SOURCE=2 -fexceptions -fstack-protector --param=ssp-buffer-size=4 -m32 -march=i386 -mtune=generic -fasynchronous-unwind-tables -DVERSION=\"0.48\" -DXS_VERSION=\"0.48\" -fPIC "-I/usr/lib/perl5/5.8.8/i386-linux-thread-multi/CORE" dbdimp.c dbdimp.c: В функции ‘create_cursor_name’ dbdimp.c:60: предупреждение: флаг '0' в сочетании с точность и ‘%x’ в формате printf игнорируется dbdimp.c:60: предупреждение: format ‘%016.16x’ expects type ‘unsigned int’, but argument 5 has type ‘isc_stmt_handle’ dbdimp.c: В функции ‘ib_st_fetch’ dbdimp.c:1452: предупреждение: format ‘%04d’ expects type ‘int’, but argument 11 has type ‘long int’ dbdimp.c:1470: предупреждение: format ‘%04d’ expects type ‘int’, but argument 8 has type ‘long int’ Running Mkbootstrap for DBD::InterBase () chmod 644 InterBase.bs rm -f blib/arch/auto/DBD/InterBase/InterBase.so gcc -shared -O2 -g -pipe -Wall -Wp,-D_FORTIFY_SOURCE=2 -fexceptions -fstack-protector --param=ssp-buffer-size=4 -m32 -march=i386 -mtune=generic -fasynchronous-unwind-tables -L/usr/local/lib InterBase.o dbdimp.o -o blib/arch/auto/DBD/InterBase/InterBase.so \ -L/opt/firebird/lib -lfbclient -ldl \
chmod 755 blib/arch/auto/DBD/InterBase/InterBase.so cp InterBase.bs blib/arch/auto/DBD/InterBase/InterBase.bs chmod 644 blib/arch/auto/DBD/InterBase/InterBase.bs Manifying blib/man3/DBD::InterBase.3pm
[root@ServerL1 DBD-InterBase-0.48]# make test PERL_DL_NONLAZY=1 /usr/local/bin/perl "-MExtUtils::Command::MM" "-e" "test_harness(0, 'blib/lib', 'blib/arch')" t/*.t t/00base..............install_driver(InterBase) failed: Can't load '/root/install/DBD-InterBase-0.48/blib/arch/auto/DBD/InterBase/InterBase.so' for module DBD::InterBase: /lib/libfbclient.so.2: undefined symbol: _Unwind_GetIP at /usr/lib/perl5/5.8.8/i386-linux-thread-multi/DynaLoader.pm line 230. at (eval 3) line 3 Compilation failed in require at (eval 3) line 3. Perhaps a required shared library or dll isn't installed where expected at t/00base.t line 38 t/00base..............dubious Test returned status 2 (wstat 512, 0x200) DIED. FAILED tests 4-5 Failed 2/5 tests, 60.00% okay t/10dsnlist...........install_driver(InterBase) failed: Can't load '/root/install/DBD-InterBase-0.48/blib/arch/auto/DBD/InterBase/InterBase.so' for module DBD::InterBase: /lib/libfbclient.so.2: undefined symbol: _Unwind_GetIP at /usr/lib/perl5/5.8.8/i386-linux-thread-multi/DynaLoader.pm line 230. at (eval 3) line 3 Compilation failed in require at (eval 3) line 3. Perhaps a required shared library or dll isn't installed where expected at t/10dsnlist.t line 46 t/10dsnlist...........dubious Test returned status 2 (wstat 512, 0x200) DIED. FAILED tests 1-2 Failed 2/2 tests, 0.00% okay t/20createdrop........install_driver(InterBase) failed: Can't load '/root/install/DBD-InterBase-0.48/blib/arch/auto/DBD/InterBase/InterBase.so' for module DBD::InterBase: /lib/libfbclient.so.2: undefined symbol: _Unwind_GetIP at /usr/lib/perl5/5.8.8/i386-linux-thread-multi/DynaLoader.pm line 230. at (eval 3) line 3 Compilation failed in require at (eval 3) line 3. Perhaps a required shared library or dll isn't installed where expected at t/20createdrop.t line 47 t/20createdrop........dubious Test returned status 2 (wstat 512, 0x200) DIED. FAILED tests 1-5 Failed 5/5 tests, 0.00% okay t/30insertfetch.......install_driver(InterBase) failed: Can't load '/root/install/DBD-InterBase-0.48/blib/arch/auto/DBD/InterBase/InterBase.so' for module DBD::InterBase: /lib/libfbclient.so.2: undefined symbol: _Unwind_GetIP at /usr/lib/perl5/5.8.8/i386-linux-thread-multi/DynaLoader.pm line 230. at (eval 3) line 3 Compilation failed in require at (eval 3) line 3. Perhaps a required shared library or dll isn't installed where expected at t/30insertfetch.t line 49 t/30insertfetch.......dubious Test returned status 2 (wstat 512, 0x200) DIED. FAILED tests 1-17 Failed 17/17 tests, 0.00% okay t/31prepare...........install_driver(InterBase) failed: Can't load '/root/install/DBD-InterBase-0.48/blib/arch/auto/DBD/InterBase/InterBase.so' for module DBD::InterBase: /lib/libfbclient.so.2: undefined symbol: _Unwind_GetIP at /usr/lib/perl5/5.8.8/i386-linux-thread-multi/DynaLoader.pm line 230. at (eval 5) line 3 Compilation failed in require at (eval 5) line 3. Perhaps a required shared library or dll isn't installed where expected at t/31prepare.t line 38 # Looks like your test died before it could output anything. t/31prepare...........dubious Test returned status 255 (wstat 65280, 0xff00) DIED. FAILED tests 1-36 Failed 36/36 tests, 0.00% okay t/40alltypes..........install_driver(InterBase) failed: Can't load '/root/install/DBD-InterBase-0.48/blib/arch/auto/DBD/InterBase/InterBase.so' for module DBD::InterBase: /lib/libfbclient.so.2: undefined symbol: _Unwind_GetIP at /usr/lib/perl5/5.8.8/i386-linux-thread-multi/DynaLoader.pm line 230. at (eval 3) line 3 Compilation failed in require at (eval 3) line 3. Perhaps a required shared library or dll isn't installed where expected at t/40alltypes.t line 86 t/40alltypes..........dubious Test returned status 2 (wstat 512, 0x200) DIED. FAILED tests 1-27 Failed 27/27 tests, 0.00% okay t/40bindparam.........install_driver(InterBase) failed: Can't load '/root/install/DBD-InterBase-0.48/blib/arch/auto/DBD/InterBase/InterBase.so' for module DBD::InterBase: /lib/libfbclient.so.2: undefined symbol: _Unwind_GetIP at /usr/lib/perl5/5.8.8/i386-linux-thread-multi/DynaLoader.pm line 230. at (eval 5) line 3 Compilation failed in require at (eval 5) line 3. Perhaps a required shared library or dll isn't installed where expected at t/40bindparam.t line 66 t/40bindparam.........dubious Test returned status 2 (wstat 512, 0x200) DIED. FAILED tests 1-26 Failed 26/26 tests, 0.00% okay t/40blobs.............install_driver(InterBase) failed: Can't load '/root/install/DBD-InterBase-0.48/blib/arch/auto/DBD/InterBase/InterBase.so' for module DBD::InterBase: /lib/libfbclient.so.2: undefined symbol: _Unwind_GetIP at /usr/lib/perl5/5.8.8/i386-linux-thread-multi/DynaLoader.pm line 230. at (eval 3) line 3 Compilation failed in require at (eval 3) line 3. Perhaps a required shared library or dll isn't installed where expected at t/40blobs.t line 69 t/40blobs.............dubious Test returned status 2 (wstat 512, 0x200) DIED. FAILED tests 1-222 Failed 222/222 tests, 0.00% okay t/40cursor............install_driver(InterBase) failed: Can't load '/root/install/DBD-InterBase-0.48/blib/arch/auto/DBD/InterBase/InterBase.so' for module DBD::InterBase: /lib/libfbclient.so.2: undefined symbol: _Unwind_GetIP at /usr/lib/perl5/5.8.8/i386-linux-thread-multi/DynaLoader.pm line 230. at (eval 3) line 3 Compilation failed in require at (eval 3) line 3. Perhaps a required shared library or dll isn't installed where expected at t/40cursor.t line 47 t/40cursor............dubious Test returned status 2 (wstat 512, 0x200) DIED. FAILED tests 1-20 Failed 20/20 tests, 0.00% okay t/40cursoron..........install_driver(InterBase) failed: Can't load '/root/install/DBD-InterBase-0.48/blib/arch/auto/DBD/InterBase/InterBase.so' for module DBD::InterBase: /lib/libfbclient.so.2: undefined symbol: _Unwind_GetIP at /usr/lib/perl5/5.8.8/i386-linux-thread-multi/DynaLoader.pm line 230. at (eval 3) line 3 Compilation failed in require at (eval 3) line 3. Perhaps a required shared library or dll isn't installed where expected at t/40cursoron.t line 48 t/40cursoron..........dubious Test returned status 2 (wstat 512, 0x200) DIED. FAILED tests 1-18 Failed 18/18 tests, 0.00% okay t/40datetime..........install_driver(InterBase) failed: Can't load '/root/install/DBD-InterBase-0.48/blib/arch/auto/DBD/InterBase/InterBase.so' for module DBD::InterBase: /lib/libfbclient.so.2: undefined symbol: _Unwind_GetIP at /usr/lib/perl5/5.8.8/i386-linux-thread-multi/DynaLoader.pm line 230. at (eval 3) line 3 Compilation failed in require at (eval 3) line 3. Perhaps a required shared library or dll isn't installed where expected at t/40datetime.t line 92 t/40datetime..........dubious Test returned status 2 (wstat 512, 0x200) DIED. FAILED tests 1-14 Failed 14/14 tests, 0.00% okay t/40doparam...........install_driver(InterBase) failed: Can't load '/root/install/DBD-InterBase-0.48/blib/arch/auto/DBD/InterBase/InterBase.so' for module DBD::InterBase: /lib/libfbclient.so.2: undefined symbol: _Unwind_GetIP at /usr/lib/perl5/5.8.8/i386-linux-thread-multi/DynaLoader.pm line 230. at (eval 5) line 3 Compilation failed in require at (eval 5) line 3. Perhaps a required shared library or dll isn't installed where expected at t/40doparam.t line 66 t/40doparam...........dubious Test returned status 2 (wstat 512, 0x200) DIED. FAILED tests 1-10 Failed 10/10 tests, 0.00% okay t/40listfields........install_driver(InterBase) failed: Can't load '/root/install/DBD-InterBase-0.48/blib/arch/auto/DBD/InterBase/InterBase.so' for module DBD::InterBase: /lib/libfbclient.so.2: undefined symbol: _Unwind_GetIP at /usr/lib/perl5/5.8.8/i386-linux-thread-multi/DynaLoader.pm line 230. at (eval 3) line 3 Compilation failed in require at (eval 3) line 3. Perhaps a required shared library or dll isn't installed where expected at t/40listfields.t line 58 t/40listfields........dubious Test returned status 2 (wstat 512, 0x200) DIED. FAILED tests 1-16 Failed 16/16 tests, 0.00% okay t/40nulls.............install_driver(InterBase) failed: Can't load '/root/install/DBD-InterBase-0.48/blib/arch/auto/DBD/InterBase/InterBase.so' for module DBD::InterBase: /lib/libfbclient.so.2: undefined symbol: _Unwind_GetIP at /usr/lib/perl5/5.8.8/i386-linux-thread-multi/DynaLoader.pm line 230. at (eval 3) line 3 Compilation failed in require at (eval 3) line 3. Perhaps a required shared library or dll isn't installed where expected at t/40nulls.t line 51 t/40nulls.............dubious Test returned status 2 (wstat 512, 0x200) DIED. FAILED tests 1-11 Failed 11/11 tests, 0.00% okay t/40numrows...........install_driver(InterBase) failed: Can't load '/root/install/DBD-InterBase-0.48/blib/arch/auto/DBD/InterBase/InterBase.so' for module DBD::InterBase: /lib/libfbclient.so.2: undefined symbol: _Unwind_GetIP at /usr/lib/perl5/5.8.8/i386-linux-thread-multi/DynaLoader.pm line 230. at (eval 3) line 3 Compilation failed in require at (eval 3) line 3. Perhaps a required shared library or dll isn't installed where expected at t/40numrows.t line 60 t/40numrows...........dubious Test returned status 2 (wstat 512, 0x200) DIED. FAILED tests 1-25 Failed 25/25 tests, 0.00% okay t/41numeric...........install_driver(InterBase) failed: Can't load '/root/install/DBD-InterBase-0.48/blib/arch/auto/DBD/InterBase/InterBase.so' for module DBD::InterBase: /lib/libfbclient.so.2: undefined symbol: _Unwind_GetIP at /usr/lib/perl5/5.8.8/i386-linux-thread-multi/DynaLoader.pm line 230. at (eval 3) line 3 Compilation failed in require at (eval 3) line 3. Perhaps a required shared library or dll isn't installed where expected at t/41numeric.t line 77 t/41numeric...........dubious Test returned status 2 (wstat 512, 0x200) DIED. FAILED tests 1-30 Failed 30/30 tests, 0.00% okay t/50chopblanks........install_driver(InterBase) failed: Can't load '/root/install/DBD-InterBase-0.48/blib/arch/auto/DBD/InterBase/InterBase.so' for module DBD::InterBase: /lib/libfbclient.so.2: undefined symbol: _Unwind_GetIP at /usr/lib/perl5/5.8.8/i386-linux-thread-multi/DynaLoader.pm line 230. at (eval 3) line 3 Compilation failed in require at (eval 3) line 3. Perhaps a required shared library or dll isn't installed where expected at t/50chopblanks.t line 58 t/50chopblanks........dubious Test returned status 2 (wstat 512, 0x200) DIED. FAILED tests 1-35 Failed 35/35 tests, 0.00% okay t/50commit............install_driver(InterBase) failed: Can't load '/root/install/DBD-InterBase-0.48/blib/arch/auto/DBD/InterBase/InterBase.so' for module DBD::InterBase: /lib/libfbclient.so.2: undefined symbol: _Unwind_GetIP at /usr/lib/perl5/5.8.8/i386-linux-thread-multi/DynaLoader.pm line 230. at (eval 3) line 3 Compilation failed in require at (eval 3) line 3. Perhaps a required shared library or dll isn't installed where expected at t/50commit.t line 65 t/50commit............dubious Test returned status 2 (wstat 512, 0x200) DIED. FAILED tests 1-30 Failed 30/30 tests, 0.00% okay t/60leaks.............skipped all skipped: Long running memory leak test t/61settx.............install_driver(InterBase) failed: Can't load '/root/install/DBD-InterBase-0.48/blib/arch/auto/DBD/InterBase/InterBase.so' for module DBD::InterBase: /lib/libfbclient.so.2: undefined symbol: _Unwind_GetIP at /usr/lib/perl5/5.8.8/i386-linux-thread-multi/DynaLoader.pm line 230. at (eval 3) line 3 Compilation failed in require at (eval 3) line 3. Perhaps a required shared library or dll isn't installed where expected at t/61settx.t line 53 t/61settx.............dubious Test returned status 2 (wstat 512, 0x200) DIED. FAILED tests 1-20 Failed 20/20 tests, 0.00% okay t/62timeout...........install_driver(InterBase) failed: Can't load '/root/install/DBD-InterBase-0.48/blib/arch/auto/DBD/InterBase/InterBase.so' for module DBD::InterBase: /lib/libfbclient.so.2: undefined symbol: _Unwind_GetIP at /usr/lib/perl5/5.8.8/i386-linux-thread-multi/DynaLoader.pm line 230. at (eval 5) line 3 Compilation failed in require at (eval 5) line 3. Perhaps a required shared library or dll isn't installed where expected at t/62timeout.t line 40 # Looks like your test died before it could output anything. t/62timeout...........dubious Test returned status 255 (wstat 65280, 0xff00) DIED. FAILED tests 1-14 Failed 14/14 tests, 0.00% okay t/70nested-sth........install_driver(InterBase) failed: Can't load '/root/install/DBD-InterBase-0.48/blib/arch/auto/DBD/InterBase/InterBase.so' for module DBD::InterBase: /lib/libfbclient.so.2: undefined symbol: _Unwind_GetIP at /usr/lib/perl5/5.8.8/i386-linux-thread-multi/DynaLoader.pm line 230. at (eval 5) line 3 Compilation failed in require at (eval 5) line 3. Perhaps a required shared library or dll isn't installed where expected at t/70nested-sth.t line 40 # Looks like your test died before it could output anything. t/70nested-sth........dubious Test returned status 255 (wstat 65280, 0xff00) DIED. FAILED tests 1-24 Failed 24/24 tests, 0.00% okay t/80event-ithreads....install_driver(InterBase) failed: Can't load '/root/install/DBD-InterBase-0.48/blib/arch/auto/DBD/InterBase/InterBase.so' for module DBD::InterBase: /lib/libfbclient.so.2: undefined symbol: _Unwind_GetIP at /usr/lib/perl5/5.8.8/i386-linux-thread-multi/DynaLoader.pm line 230. at (eval 5) line 3 Compilation failed in require at (eval 5) line 3. Perhaps a required shared library or dll isn't installed where expected at t/80event-ithreads.t line 47 # Looks like your test died before it could output anything. t/80event-ithreads....dubious Test returned status 255 (wstat 65280, 0xff00) DIED. FAILED tests 1-22 Failed 22/22 tests, 0.00% okay t/81event-fork........install_driver(InterBase) failed: Can't load '/root/install/DBD-InterBase-0.48/blib/arch/auto/DBD/InterBase/InterBase.so' for module DBD::InterBase: /lib/libfbclient.so.2: undefined symbol: _Unwind_GetIP at /usr/lib/perl5/5.8.8/i386-linux-thread-multi/DynaLoader.pm line 230. at (eval 5) line 3 Compilation failed in require at (eval 5) line 3. Perhaps a required shared library or dll isn't installed where expected at t/81event-fork.t line 40 # Looks like your test died before it could output anything. t/81event-fork........dubious Test returned status 255 (wstat 65280, 0xff00) DIED. FAILED tests 1-17 Failed 17/17 tests, 0.00% okay t/90dbinfo............install_driver(InterBase) failed: Can't load '/root/install/DBD-InterBase-0.48/blib/arch/auto/DBD/InterBase/InterBase.so' for module DBD::InterBase: /lib/libfbclient.so.2: undefined symbol: _Unwind_GetIP at /usr/lib/perl5/5.8.8/i386-linux-thread-multi/DynaLoader.pm line 230. at (eval 5) line 3 Compilation failed in require at (eval 5) line 3. Perhaps a required shared library or dll isn't installed where expected at t/90dbinfo.t line 37 # Looks like your test died before it could output anything. t/90dbinfo............dubious Test returned status 255 (wstat 65280, 0xff00) DIED. FAILED tests 1-13 Failed 13/13 tests, 0.00% okay t/91txinfo............install_driver(InterBase) failed: Can't load '/root/install/DBD-InterBase-0.48/blib/arch/auto/DBD/InterBase/InterBase.so' for module DBD::InterBase: /lib/libfbclient.so.2: undefined symbol: _Unwind_GetIP at /usr/lib/perl5/5.8.8/i386-linux-thread-multi/DynaLoader.pm line 230. at (eval 5) line 3 Compilation failed in require at (eval 5) line 3. Perhaps a required shared library or dll isn't installed where expected at t/91txinfo.t line 38 # Looks like your test died before it could output anything. t/91txinfo............dubious Test returned status 255 (wstat 65280, 0xff00) DIED. FAILED tests 1-9 Failed 9/9 tests, 0.00% okay t/ak-dbd..............install_driver(InterBase) failed: Can't load '/root/install/DBD-InterBase-0.48/blib/arch/auto/DBD/InterBase/InterBase.so' for module DBD::InterBase: /lib/libfbclient.so.2: undefined symbol: _Unwind_GetIP at /usr/lib/perl5/5.8.8/i386-linux-thread-multi/DynaLoader.pm line 230. at (eval 3) line 3 Compilation failed in require at (eval 3) line 3. Perhaps a required shared library or dll isn't installed where expected at t/ak-dbd.t line 60 t/ak-dbd..............dubious Test returned status 2 (wstat 512, 0x200) DIED. FAILED tests 1-48 Failed 48/48 tests, 0.00% okay t/dbdadmin............install_driver(InterBase) failed: Can't load '/root/install/DBD-InterBase-0.48/blib/arch/auto/DBD/InterBase/InterBase.so' for module DBD::InterBase: /lib/libfbclient.so.2: undefined symbol: _Unwind_GetIP at /usr/lib/perl5/5.8.8/i386-linux-thread-multi/DynaLoader.pm line 230. at (eval 3) line 3 Compilation failed in require at (eval 3) line 3. Perhaps a required shared library or dll isn't installed where expected at t/dbdadmin.t line 60 t/dbdadmin............dubious Test returned status 2 (wstat 512, 0x200) DIED. FAILED tests 1-3 Failed 3/3 tests, 0.00% okay Failed Test Stat Wstat Total Fail Failed List of Failed ------------------------------------------------------------------------------- t/00base.t 2 512 5 4 80.00% 4-5 t/10dsnlist.t 2 512 2 4 200.00% 1-2 t/20createdrop.t 2 512 5 10 200.00% 1-5 t/30insertfetch.t 2 512 17 34 200.00% 1-17 t/31prepare.t 255 65280 36 72 200.00% 1-36 t/40alltypes.t 2 512 27 54 200.00% 1-27 t/40bindparam.t 2 512 26 52 200.00% 1-26 t/40blobs.t 2 512 222 444 200.00% 1-222 t/40cursor.t 2 512 20 40 200.00% 1-20 t/40cursoron.t 2 512 18 36 200.00% 1-18 t/40datetime.t 2 512 14 28 200.00% 1-14 t/40doparam.t 2 512 10 20 200.00% 1-10 t/40listfields.t 2 512 16 32 200.00% 1-16 t/40nulls.t 2 512 11 22 200.00% 1-11 t/40numrows.t 2 512 25 50 200.00% 1-25 t/41numeric.t 2 512 30 60 200.00% 1-30 t/50chopblanks.t 2 512 35 70 200.00% 1-35 t/50commit.t 2 512 30 60 200.00% 1-30 t/61settx.t 2 512 20 40 200.00% 1-20 t/62timeout.t 255 65280 14 28 200.00% 1-14 t/70nested-sth.t 255 65280 24 48 200.00% 1-24 t/80event-ithreads.t 255 65280 22 44 200.00% 1-22 t/81event-fork.t 255 65280 17 34 200.00% 1-17 t/90dbinfo.t 255 65280 13 26 200.00% 1-13 t/91txinfo.t 255 65280 9 18 200.00% 1-9 t/ak-dbd.t 2 512 48 96 200.00% 1-48 t/dbdadmin.t 2 512 3 6 200.00% 1-3 1 test skipped. Failed 27/28 test scripts, 3.57% okay. 716/719 subtests failed, 0.42% okay. make: *** [test_dynamic] Ошибка 2
|
После этого `make install` как-то не звучит. Это был вариант с rpm-кой.
|