При компиляции выходит ошибка. Кто нибудь ставил эту библиотеку на WinXP? подскажите в чем может быть проблема. Инструкцию по установке читал и все делал по ней. | Код | make[1]: Entering directory `/c/ACE_wrappers72/ace'
GNUmakefile: /c/ACE_wrappers72/ace/GNUmakefile.ACE MAKEFLAGS= --unix -w
g++ -Wpointer-arith -mthreads -mtune=pentiumpro -O3 -g -pipe -pipe -I/c/ACE_wrappers72 -DACE_HAS_EXCEPTIONS -DACE_NO_INLINE -I.. -DACE_BUILD_DLL -c -o .shobj/Local_Name_Space.o Local_Name_Space.cpp In file included from c:/ACE_wrappers72/ace/config.h:1, from c:/ACE_wrappers72/ace/config-macros.h:24, from c:/ACE_wrappers72/ace/config-lite.h:24, from c:/ACE_wrappers72/ace/ACE_export.h:11, from c:/ACE_wrappers72/ace/Malloc.h:18, from c:/ACE_wrappers72/ace/Malloc_T.h:18, from c:/ACE_wrappers72/ace/Local_Name_Space.h:20, from Local_Name_Space.cpp:1: c:/ACE_wrappers72/ace/config-win32.h:55:30: warning: no newline at end of file In file included from c:/ACE_wrappers72/ace/TSS_T.cpp:19, from c:/ACE_wrappers72/ace/TSS_T.h:245, from c:/ACE_wrappers72/ace/Singleton.h:24, from c:/ACE_wrappers72/ace/Service_Gestalt.h:30, from c:/ACE_wrappers72/ace/Service_Object.h:27, from c:/ACE_wrappers72/ace/Naming_Context.h:25, from c:/ACE_wrappers72/ace/Local_Name_Space_T.h:25, from c:/ACE_wrappers72/ace/Local_Name_Space.h:128, from Local_Name_Space.cpp:1: c:/ACE_wrappers72/ace/OS_NS_stdio.h: In function `void* ace_fileno_helper(FILE*)': c:/ACE_wrappers72/ace/OS_NS_stdio.h:120: error: expected primary-expression before ')' token c:/ACE_wrappers72/ace/OS_NS_stdio.h:120: error: expected `;' before "_get_osfhandle" c:/ACE_wrappers72/ace/OS_NS_stdio.h:120: error: expected id-expression before '(' token make[1]: *** [.shobj/Local_Name_Space.o] Error 1 make[1]: Leaving directory `/c/ACE_wrappers72/ace' make: *** [ACE] Error 2
|
Платформа Windows Xp, изпользую MinGW 5.1.4 и MSys 1.0.11, ACE 5.7.2
|