![]() |
|
Модераторы: LSD, AntonSaburov |
![]()
|
|
| Pitch |
|
|||
|
Новичок Профиль Группа: Участник Сообщений: 1 Регистрация: 18.2.2008 Репутация: нет Всего: нет |
Народ кто подскажет, в чем тут дело? Тока ненужно кидаться в нуба ссаными тряпками в нуба )
пытаюсь скомпилить проектик с помощью мавена ---------------------------------------------------------------------------------------------------------- + Error stacktraces are turned on. Maven version: 2.0.8 Java version: 1.5.0 OS name: "freebsd" version: "6.1-release" arch: "i386" Family: "unix" [DEBUG] Building Maven user-level plugin registry from: '/root/.m2/plugin-registry.xml' [DEBUG] Building Maven global-level plugin registry from: '/usr/local/share/java/maven2/conf/plugin-registry.xml' [INFO] Scanning for projects... [INFO] Searching repository for plugin with prefix: 'assembly'. [DEBUG] Loading plugin prefixes from group: org.apache.maven.plugins [DEBUG] Skipping disabled repository Maven Snapshots [DEBUG] Loading plugin prefixes from group: org.codehaus.mojo [DEBUG] Skipping disabled repository Maven Snapshots [DEBUG] Retrieving parent-POM: org.apache.maven.plugins:maven-plugins::1 for project: null:maven-assembly-plugin:maven-plugin:2.1 from the repository. [DEBUG] Retrieving parent-POM: org.apache.maven:maven-parent::1 for project: org.apache.maven.plugins:maven-plugins:pom:1 from the repository. [DEBUG] Retrieving parent-POM: org.apache:apache::1 for project: org.apache.maven:maven-parent:pom:1 from the repository. [INFO] ------------------------------------------------------------------------ [INFO] Building Unnamed - L2Emu:l2j-gameserver:jar:1.0.0 [INFO] task-segment: [assembly:assembly] (aggregator-style) [INFO] ------------------------------------------------------------------------ [INFO] Preparing assembly:assembly [INFO] ------------------------------------------------------------------------ [INFO] Building Unnamed - L2Emu:l2j-gameserver:jar:1.0.0 [INFO] ------------------------------------------------------------------------ [DEBUG] Skipping disabled repository Maven Snapshots [DEBUG] maven-resources-plugin: resolved to version 2.2 from repository central [DEBUG] Skipping disabled repository Maven Snapshots [DEBUG] maven-compiler-plugin: resolved to version 2.0.2 from repository central [DEBUG] Retrieving parent-POM: org.apache.maven.plugins:maven-plugins::8 for project: null:maven-compiler-plugin:maven-plugin:2.0.2 from the repository. [DEBUG] Retrieving parent-POM: org.apache.maven:maven-parent::5 for project: org.apache.maven.plugins:maven-plugins:pom:8 from the repository. [DEBUG] Retrieving parent-POM: org.apache:apache::3 for project: org.apache.maven:maven-parent:pom:5 from the repository. [DEBUG] Skipping disabled repository Maven Snapshots [DEBUG] maven-surefire-plugin: resolved to version 2.4 from repository central [DEBUG] Retrieving parent-POM: org.apache.maven.surefire:surefire::2.4 for project: org.apache.maven.plugins:maven-surefire-plugin:maven-plugin:null from the repository. [DEBUG] Retrieving parent-POM: org.apache.maven:maven-parent::7 for project: org.apache.maven.surefire:surefire:pom:2.4 from the repository. [DEBUG] Retrieving parent-POM: org.apache:apache::4 for project: org.apache.maven:maven-parent:pom:7 from the repository. [DEBUG] Adding managed dependencies for org.apache.maven.plugins:maven-surefire-plugin [DEBUG] org.apache.maven.surefire:surefire-api:jar:2.4 [DEBUG] org.apache.maven.surefire:surefire-booter:jar:2.4 [DEBUG] org.codehaus.plexus:plexus-utils:jar:1.4.9 [DEBUG] Skipping disabled repository Maven Snapshots [DEBUG] maven-jar-plugin: resolved to version 2.2 from repository central [DEBUG] Retrieving parent-POM: org.apache.maven.plugins:maven-plugins::10 for project: null:maven-jar-plugin:maven-plugin:2.2 from the repository. [DEBUG] org.codehaus.mojo:maven-buildnumber-plugin:maven-plugin:0.9.5:runtime (selected for runtime) [DEBUG] Retrieving parent-POM: org.apache.maven.scm:maven-scm-providers-cvs::1.0-beta-3 for project: null:maven-scm-provider-cvsexe:jar:1.0-beta-3 from the repository. [DEBUG] Retrieving parent-POM: org.apache.maven.scm:maven-scm-providers::1.0-beta-3 for project: null:maven-scm-providers-cvs:pom:1.0-beta-3 from the repository. [DEBUG] Retrieving parent-POM: org.apache.maven.scm:maven-scm::1.0-beta-3 for project: null:maven-scm-providers:pom:1.0-beta-3 from the repository. [DEBUG] org.apache.maven.scm:maven-scm-provider-cvsexe:jar:1.0-beta-3:runtime (selected for runtime) [DEBUG] Retrieving parent-POM: org.codehaus.plexus:plexus::1.0.4 for project: null:plexus-utils:jar:1.1 from the repository. [DEBUG] org.codehaus.plexus:plexus-utils:jar:1.1:runtime (selected for runtime) [DEBUG] org.apache.maven.scm:maven-scm-api:jar:1.0-beta-3:runtime (selected for runtime) [DEBUG] junit:junit:jar:3.8.1:runtime (selected for runtime) [DEBUG] org.apache.maven.scm:maven-scm-provider-cvs-commons:jar:1.0-beta-3:runtime (selected for runtime) [DEBUG] org.codehaus.plexus:plexus-utils:jar:1.1:runtime (selected for runtime) [DEBUG] org.apache.maven.scm:maven-scm-provider-perforce:jar:1.0-beta-3:runtime (selected for runtime) [DEBUG] regexp:regexp:jar:1.3:runtime (selected for runtime) [DEBUG] org.apache.maven.scm:maven-scm-provider-starteam:jar:1.0-beta-3:runtime (selected for runtime) [DEBUG] org.apache.maven.scm:maven-scm-provider-clearcase:jar:1.0-beta-3:runtime (selected for runtime) [DEBUG] com.svnkit:svnkit:jar:1.1.0:runtime (selected for runtime) [DEBUG] ch.ethz.ganymed:ganymed-ssh2:jar:build210:runtime (selected for runtime) [DEBUG] Retrieving parent-POM: org.apache.maven:maven::2.0.2 for project: null:maven-project:jar:2.0.2 from the repository. [DEBUG] Adding managed dependencies for unknown:maven-project [DEBUG] org.codehaus.plexus:plexus-container-default:jar:1.0-alpha-9 [DEBUG] org.codehaus.plexus:plexus-utils:jar:1.1 [DEBUG] org.apache.maven.wagon:wagon-provider-api:jar:1.0-alpha-6 [DEBUG] org.apache.maven.wagon:wagon-ssh:jar:1.0-alpha-6 [DEBUG] org.apache.maven.wagon:wagon-ssh-external:jar:1.0-alpha-6 [DEBUG] org.apache.maven.wagon:wagon-file:jar:1.0-alpha-6 [DEBUG] org.apache.maven.wagon:wagon-http-lightweight:jar:1.0-alpha-6 [DEBUG] org.apache.maven:maven-project:jar:2.0.2:runtime (selected for runtime) [DEBUG] Adding managed dependencies for unknown:maven-profile [DEBUG] org.codehaus.plexus:plexus-container-default:jar:1.0-alpha-9 [DEBUG] org.codehaus.plexus:plexus-utils:jar:1.1 [DEBUG] org.apache.maven.wagon:wagon-provider-api:jar:1.0-alpha-6 [DEBUG] org.apache.maven.wagon:wagon-ssh:jar:1.0-alpha-6 [DEBUG] org.apache.maven.wagon:wagon-ssh-external:jar:1.0-alpha-6 [DEBUG] org.apache.maven.wagon:wagon-file:jar:1.0-alpha-6 [DEBUG] org.apache.maven.wagon:wagon-http-lightweight:jar:1.0-alpha-6 [DEBUG] org.apache.maven:maven-profile:jar:2.0.2:runtime (selected for runtime) [DEBUG] Adding managed dependencies for org.apache.maven:maven-model [DEBUG] org.codehaus.plexus:plexus-container-default:jar:1.0-alpha-9 [DEBUG] org.codehaus.plexus:plexus-utils:jar:1.1 [DEBUG] org.apache.maven.wagon:wagon-provider-api:jar:1.0-alpha-6 [DEBUG] org.apache.maven.wagon:wagon-ssh:jar:1.0-alpha-6 [DEBUG] org.apache.maven.wagon:wagon-ssh-external:jar:1.0-alpha-6 [DEBUG] org.apache.maven.wagon:wagon-file:jar:1.0-alpha-6 [DEBUG] org.apache.maven.wagon:wagon-http-lightweight:jar:1.0-alpha-6 [DEBUG] org.apache.maven:maven-model:jar:2.0.2:runtime (selected for runtime) [DEBUG] Retrieving parent-POM: org.codehaus.plexus:plexus-containers::1.0.3 for project: null:plexus-container-default:jar:1.0-alpha-9 from the repository. [DEBUG] org.codehaus.plexus:plexus-container-default:jar:1.0-alpha-9:runtime (selected for runtime) [DEBUG] org.codehaus.plexus:plexus-utils:jar:1.0.4:runtime (removed - nearer found: 1.1) [DEBUG] classworlds:classworlds:jar:1.1-alpha-2:runtime (selected for runtime) [DEBUG] org.apache.maven:maven-model:jar:2.0.2:runtime (selected for runtime) [DEBUG] Adding managed dependencies for org.apache.maven:maven-artifact-manager [DEBUG] org.codehaus.plexus:plexus-container-default:jar:1.0-alpha-9 [DEBUG] org.codehaus.plexus:plexus-utils:jar:1.1 [DEBUG] org.apache.maven.wagon:wagon-provider-api:jar:1.0-alpha-6 [DEBUG] org.apache.maven.wagon:wagon-ssh:jar:1.0-alpha-6 [DEBUG] org.apache.maven.wagon:wagon-ssh-external:jar:1.0-alpha-6 [DEBUG] org.apache.maven.wagon:wagon-file:jar:1.0-alpha-6 [DEBUG] org.apache.maven.wagon:wagon-http-lightweight:jar:1.0-alpha-6 [DEBUG] org.apache.maven:maven-artifact-manager:jar:2.0.2:runtime (selected for runtime) [DEBUG] Adding managed dependencies for org.apache.maven:maven-repository-metadata [DEBUG] org.codehaus.plexus:plexus-container-default:jar:1.0-alpha-9 [DEBUG] org.codehaus.plexus:plexus-utils:jar:1.1 [DEBUG] org.apache.maven.wagon:wagon-provider-api:jar:1.0-alpha-6 [DEBUG] org.apache.maven.wagon:wagon-ssh:jar:1.0-alpha-6 [DEBUG] org.apache.maven.wagon:wagon-ssh-external:jar:1.0-alpha-6 [DEBUG] org.apache.maven.wagon:wagon-file:jar:1.0-alpha-6 [DEBUG] org.apache.maven.wagon:wagon-http-lightweight:jar:1.0-alpha-6 [DEBUG] org.apache.maven:maven-repository-metadata:jar:2.0.2:runtime (selected for runtime) [DEBUG] Adding managed dependencies for org.apache.maven:maven-artifact [DEBUG] org.codehaus.plexus:plexus-container-default:jar:1.0-alpha-9 [DEBUG] org.codehaus.plexus:plexus-utils:jar:1.1 [DEBUG] org.apache.maven.wagon:wagon-provider-api:jar:1.0-alpha-6 [DEBUG] org.apache.maven.wagon:wagon-ssh:jar:1.0-alpha-6 [DEBUG] org.apache.maven.wagon:wagon-ssh-external:jar:1.0-alpha-6 [DEBUG] org.apache.maven.wagon:wagon-file:jar:1.0-alpha-6 [DEBUG] org.apache.maven.wagon:wagon-http-lightweight:jar:1.0-alpha-6 [DEBUG] org.apache.maven:maven-artifact:jar:2.0.2:runtime (selected for runtime) [DEBUG] Retrieving parent-POM: org.apache.maven.wagon:wagon::1.0-alpha-6 for project: null:wagon-provider-api:jar:1.0-alpha-6 from the repository. [DEBUG] Adding managed dependencies for unknown:wagon-provider-api [DEBUG] org.apache.maven.wagon:wagon-provider-api:jar:1.0-alpha-6 [DEBUG] org.apache.maven.wagon:wagon-provider-test:jar:1.0-alpha-6 [DEBUG] junit:junit:jar:3.8.1 [DEBUG] org.codehaus.plexus:plexus-container-default:jar:1.0-alpha-8 [DEBUG] org.codehaus.plexus:plexus-utils:jar:1.0.4 [DEBUG] org.apache.maven.wagon:wagon-provider-api:jar:1.0-alpha-6:runtime (selected for runtime) [DEBUG] org.codehaus.plexus:plexus-utils:jar:1.0.4:runtime (removed - nearer found: 1.1) [DEBUG] org.apache.maven:maven-artifact:jar:2.0.2:runtime (selected for runtime) [DEBUG] org.codehaus.plexus:plexus-container-default:jar:1.0-alpha-9:runtime (selected for runtime) [DEBUG] org.codehaus.plexus:plexus-utils:jar:1.0.4:runtime (removed - nearer found: 1.1) [DEBUG] classworlds:classworlds:jar:1.1-alpha-2:runtime (selected for runtime) [DEBUG] org.apache.maven.scm:maven-scm-api:jar:1.0-beta-3:runtime (selected for runtime) [DEBUG] junit:junit:jar:3.8.1:runtime (selected for runtime) [DEBUG] Adding managed dependencies for org.apache.maven:maven-plugin-api [DEBUG] org.codehaus.plexus:plexus-container-default:jar:1.0-alpha-9 [DEBUG] org.codehaus.plexus:plexus-utils:jar:1.1 [DEBUG] org.apache.maven.wagon:wagon-provider-api:jar:1.0-alpha-6 [DEBUG] org.apache.maven.wagon:wagon-ssh:jar:1.0-alpha-6 [DEBUG] org.apache.maven.wagon:wagon-ssh-external:jar:1.0-alpha-6 [DEBUG] org.apache.maven.wagon:wagon-file:jar:1.0-alpha-6 [DEBUG] org.apache.maven.wagon:wagon-http-lightweight:jar:1.0-alpha-6 [DEBUG] org.apache.maven:maven-plugin-api:jar:2.0.2:runtime (selected for runtime) [DEBUG] Adding managed dependencies for unknown:maven-settings [DEBUG] org.codehaus.plexus:plexus-container-default:jar:1.0-alpha-9 [DEBUG] org.codehaus.plexus:plexus-utils:jar:1.1 [DEBUG] org.apache.maven.wagon:wagon-provider-api:jar:1.0-alpha-6 [DEBUG] org.apache.maven.wagon:wagon-ssh:jar:1.0-alpha-6 [DEBUG] org.apache.maven.wagon:wagon-ssh-external:jar:1.0-alpha-6 [DEBUG] org.apache.maven.wagon:wagon-file:jar:1.0-alpha-6 [DEBUG] org.apache.maven.wagon:wagon-http-lightweight:jar:1.0-alpha-6 [DEBUG] org.apache.maven:maven-settings:jar:2.0.2:runtime (selected for runtime) [DEBUG] Retrieving parent-POM: org.apache.maven.scm:maven-scm-providers-svn::1.0-beta-3 for project: null:maven-scm-provider-svnexe:jar:1.0-beta-3 from the repository. [DEBUG] org.apache.maven.scm:maven-scm-provider-svnexe:jar:1.0-beta-3:runtime (selected for runtime) [DEBUG] org.apache.maven.scm:maven-scm-provider-svn-commons:jar:1.0-beta-3:runtime (selected for runtime) [DEBUG] Retrieving parent-POM: org.apache.maven.scm:maven-scm-managers::1.0-beta-3 for project: null:maven-scm-manager-plexus:jar:1.0-beta-3 from the repository. [DEBUG] org.apache.maven.scm:maven-scm-manager-plexus:jar:1.0-beta-3:runtime (selected for runtime) [DEBUG] Configuring mojo 'org.codehaus.mojo:maven-buildnumber-plugin:0.9.5:create' --> [DEBUG] (s) basedir = /usr/la2server/inerlud/trunk/L2Emu_GameServer_CT1 [DEBUG] (s) doCheck = false [DEBUG] (s) doUpdate = false [DEBUG] (f) project = MavenProject: L2Emu:l2j-gameserver:1.0.0 @ /usr/la2server/inerlud/trunk/L2Emu_GameServer_CT1/pom.xml [DEBUG] (s) urlScm = scm:svn:svn://www.l2jfree.com/repo/l2j-free/trunk/L2_GameServer_CT1 [DEBUG] -- end configuration -- [INFO] [buildnumber:create {execution: default}] [INFO] Storing buildNumber: 2323 [DEBUG] org.apache.maven.plugins:maven-resources-plugin:maven-plugin:2.2:runtime (selected for runtime) [DEBUG] Retrieving parent-POM: org.apache.maven:maven::2.0 for project: org.apache.maven:maven-model:jar:2.0 from the repository. [DEBUG] Adding managed dependencies for org.apache.maven:maven-model [DEBUG] org.codehaus.plexus:plexus-container-default:jar:1.0-alpha-8 [DEBUG] org.codehaus.plexus:plexus-utils:jar:1.0.4 [DEBUG] org.apache.maven.wagon:wagon-provider-api:jar:1.0-alpha-5 [DEBUG] org.apache.maven.wagon:wagon-ssh:jar:1.0-alpha-5 [DEBUG] org.apache.maven.wagon:wagon-file:jar:1.0-alpha-5 [DEBUG] org.apache.maven.wagon:wagon-http-lightweight:jar:1.0-alpha-5 [DEBUG] org.apache.maven:maven-model:jar:2.0:runtime (selected for runtime) [DEBUG] org.codehaus.plexus:plexus-utils:jar:1.0.4:runtime (selected for runtime) [DEBUG] org.codehaus.plexus:plexus-utils:jar:1.0.4:runtime (removed - nearer found: 1.1) [DEBUG] org.codehaus.plexus:plexus-utils:jar:1.1:runtime (selected for runtime) [DEBUG] Adding managed dependencies for unknown:maven-project [DEBUG] org.codehaus.plexus:plexus-container-default:jar:1.0-alpha-8 [DEBUG] org.codehaus.plexus:plexus-utils:jar:1.0.4 [DEBUG] org.apache.maven.wagon:wagon-provider-api:jar:1.0-alpha-5 [DEBUG] org.apache.maven.wagon:wagon-ssh:jar:1.0-alpha-5 [DEBUG] org.apache.maven.wagon:wagon-file:jar:1.0-alpha-5 [DEBUG] org.apache.maven.wagon:wagon-http-lightweight:jar:1.0-alpha-5 [DEBUG] org.apache.maven:maven-project:jar:2.0:runtime (selected for runtime) [DEBUG] Adding managed dependencies for unknown:maven-profile [DEBUG] org.codehaus.plexus:plexus-container-default:jar:1.0-alpha-8 [DEBUG] org.codehaus.plexus:plexus-utils:jar:1.0.4 [DEBUG] org.apache.maven.wagon:wagon-provider-api:jar:1.0-alpha-5 [DEBUG] org.apache.maven.wagon:wagon-ssh:jar:1.0-alpha-5 [DEBUG] org.apache.maven.wagon:wagon-file:jar:1.0-alpha-5 [DEBUG] org.apache.maven.wagon:wagon-http-lightweight:jar:1.0-alpha-5 [DEBUG] org.apache.maven:maven-profile:jar:2.0:runtime (selected for runtime) [DEBUG] org.codehaus.plexus:plexus-utils:jar:1.0.4:runtime (removed - nearer found: 1.1) [DEBUG] org.codehaus.plexus:plexus-container-default:jar:1.0-alpha-8:runtime (selected for runtime) [DEBUG] org.codehaus.plexus:plexus-utils:jar:1.0.4:runtime (removed - nearer found: 1.1) [DEBUG] junit:junit:jar:3.8.1:runtime (selected for runtime) [DEBUG] classworlds:classworlds:jar:1.1-alpha-2:runtime (selected for runtime) [DEBUG] Adding managed dependencies for org.apache.maven:maven-artifact-manager [DEBUG] org.codehaus.plexus:plexus-container-default:jar:1.0-alpha-8 [DEBUG] org.codehaus.plexus:plexus-utils:jar:1.0.4 [DEBUG] org.apache.maven.wagon:wagon-provider-api:jar:1.0-alpha-5 [DEBUG] org.apache.maven.wagon:wagon-ssh:jar:1.0-alpha-5 [DEBUG] org.apache.maven.wagon:wagon-file:jar:1.0-alpha-5 [DEBUG] org.apache.maven.wagon:wagon-http-lightweight:jar:1.0-alpha-5 [DEBUG] org.apache.maven:maven-artifact-manager:jar:2.0:runtime (selected for runtime) [DEBUG] Adding managed dependencies for org.apache.maven:maven-repository-metadata [DEBUG] org.codehaus.plexus:plexus-container-default:jar:1.0-alpha-8 [DEBUG] org.codehaus.plexus:plexus-utils:jar:1.0.4 [DEBUG] org.apache.maven.wagon:wagon-provider-api:jar:1.0-alpha-5 [DEBUG] org.apache.maven.wagon:wagon-ssh:jar:1.0-alpha-5 [DEBUG] org.apache.maven.wagon:wagon-file:jar:1.0-alpha-5 [DEBUG] org.apache.maven.wagon:wagon-http-lightweight:jar:1.0-alpha-5 [DEBUG] org.apache.maven:maven-repository-metadata:jar:2.0:runtime (selected for runtime) [DEBUG] org.codehaus.plexus:plexus-utils:jar:1.0.4:runtime (removed - nearer found: 1.1) [DEBUG] org.codehaus.plexus:plexus-utils:jar:1.0.4:runtime (removed - nearer found: 1.1) [DEBUG] Adding managed dependencies for org.apache.maven:maven-artifact [DEBUG] org.codehaus.plexus:plexus-container-default:jar:1.0-alpha-8 [DEBUG] org.codehaus.plexus:plexus-utils:jar:1.0.4 [DEBUG] org.apache.maven.wagon:wagon-provider-api:jar:1.0-alpha-5 [DEBUG] org.apache.maven.wagon:wagon-ssh:jar:1.0-alpha-5 [DEBUG] org.apache.maven.wagon:wagon-file:jar:1.0-alpha-5 [DEBUG] org.apache.maven.wagon:wagon-http-lightweight:jar:1.0-alpha-5 [DEBUG] org.apache.maven:maven-artifact:jar:2.0:runtime (selected for runtime) [DEBUG] org.codehaus.plexus:plexus-utils:jar:1.0.4:runtime (removed - nearer found: 1.1) [DEBUG] org.apache.maven.wagon:wagon-provider-api:jar:1.0-alpha-5:runtime (selected for runtime) [DEBUG] org.codehaus.plexus:plexus-utils:jar:1.0.4:runtime (removed - nearer found: 1.1) [DEBUG] org.codehaus.plexus:plexus-utils:jar:1.0.4:runtime (removed - nearer found: 1.1) [DEBUG] org.apache.maven:maven-artifact:jar:2.0:runtime (selected for runtime) [DEBUG] org.codehaus.plexus:plexus-utils:jar:1.0.4:runtime (removed - nearer found: 1.1) [DEBUG] org.codehaus.plexus:plexus-container-default:jar:1.0-alpha-8:runtime (selected for runtime) [DEBUG] org.codehaus.plexus:plexus-utils:jar:1.0.4:runtime (removed - nearer found: 1.1) [DEBUG] junit:junit:jar:3.8.1:runtime (selected for runtime) [DEBUG] classworlds:classworlds:jar:1.1-alpha-2:runtime (selected for runtime) [DEBUG] Adding managed dependencies for org.apache.maven:maven-plugin-api [DEBUG] org.codehaus.plexus:plexus-container-default:jar:1.0-alpha-8 [DEBUG] org.codehaus.plexus:plexus-utils:jar:1.0.4 [DEBUG] org.apache.maven.wagon:wagon-provider-api:jar:1.0-alpha-5 [DEBUG] org.apache.maven.wagon:wagon-ssh:jar:1.0-alpha-5 [DEBUG] org.apache.maven.wagon:wagon-file:jar:1.0-alpha-5 [DEBUG] org.apache.maven.wagon:wagon-http-lightweight:jar:1.0-alpha-5 [DEBUG] org.apache.maven:maven-plugin-api:jar:2.0:runtime (selected for runtime) [DEBUG] Configuring mojo 'org.apache.maven.plugins:maven-resources-plugin:2.2:resources' --> [DEBUG] (f) filters = [] [DEBUG] (f) outputDirectory = /usr/la2server/inerlud/trunk/L2Emu_GameServer_CT1/target/classes [DEBUG] (f) project = MavenProject: L2Emu:l2j-gameserver:1.0.0 @ /usr/la2server/inerlud/trunk/L2Emu_GameServer_CT1/pom.xml [DEBUG] (f) resources = [org.apache.maven.model.Resource@ef83d3] [DEBUG] -- end configuration -- [INFO] [resources:resources] [INFO] Using default encoding to copy filtered resources. [DEBUG] L2Emu:l2j-gameserver:jar:1.0.0 (selected for null) [DEBUG] Retrieving parent-POM: l2jfree:l2jfreeParent::1.0.1 for project: null:l2j-commons:jar:1.1.2 from the repository. [DEBUG] l2jfree:l2j-commons:jar:1.1.2:compile (selected for compile) [DEBUG] commons-logging:commons-logging:jar:1.1:compile (selected for compile) [DEBUG] log4j:log4j:jar:1.2.12:compile (selected for compile) [DEBUG] commons-lang:commons-lang:jar:2.1:compile (selected for compile) [DEBUG] log4j:log4j:jar:1.2.12:compile (selected for compile) [DEBUG] org.apache.bsf:bsf:jar:2.0:compile (selected for compile) [DEBUG] commons-io:commons-io:jar:1.2:compile (selected for compile) [DEBUG] org.hibernate:hibernate:jar:3.2.2.ga:compile (selected for compile) [DEBUG] net.sf.ehcache:ehcache:jar:1.2.3:compile (selected for compile) [DEBUG] commons-logging:commons-logging:jar:1.0.4:compile (removed - nearer found: 1.1) [DEBUG] commons-collections:commons-collections:jar:2.1:compile (selected for compile) [DEBUG] javax.transaction:jta:jar:1.0.1B:compile (selected for compile) [DEBUG] commons-logging:commons-logging:jar:1.0.4:compile (removed - nearer found: 1.1) [DEBUG] asm:asm-attrs:jar:1.5.3:compile (selected for compile) [DEBUG] dom4j:dom4j:jar:1.6.1:compile (selected for compile) [DEBUG] antlr:antlr:jar:2.7.6:compile (selected for compile) [DEBUG] cglib:cglib:jar:2.1_3:compile (selected for compile) [DEBUG] asm:asm:jar:1.5.3:compile (selected for compile) [DEBUG] asm:asm:jar:1.5.3:compile (selected for compile) [DEBUG] commons-collections:commons-collections:jar:2.1:compile (removed - nearer found: 2.1.1) [DEBUG] commons-collections:commons-collections:jar:2.1.1:compile (selected for compile) [DEBUG] c3p0:c3p0:jar:0.9.1.2:compile (selected for compile) [DEBUG] javolution:javolution:jar:1.5.4.2.6:compile (selected for compile) [DEBUG] mysql:mysql-connector-java:jar:5.1.5:compile (selected for compile) [DEBUG] org.springframework:spring:jar:2.0.2:compile (selected for compile) [DEBUG] l2jfree:l2j-mmocore:jar:1.0.6:compile (selected for compile) [DEBUG] l2jfree:l2j-test-tools:jar:1.0.2:test (selected for test) [DEBUG] org.springframework:spring-mock:jar:2.0.2:test (selected for test) [DEBUG] junit:junit:jar:3.8.1:test (selected for test) [DEBUG] dbunit:dbunit:jar:2.1:test (selected for test) [DEBUG] org.apache.derby:derby:jar:10.1.3.1:test (selected for test) [DEBUG] junit:junit:jar:3.8.1:test (selected for test) [DEBUG] log4j:log4j:jar:1.2.12:compile (removed - nearer found: 1.2.14) [DEBUG] log4j:log4j:jar:1.2.14:compile (selected for compile) [DEBUG] org.apache.bsf:bsf:jar:2.0:compile (selected for compile) [DEBUG] Retrieving parent-POM: org.beanshell:beanshell::2.0b4 for project: null:bsh:jar:null from the repository. [DEBUG] org.beanshell:bsh:jar:2.0b4:compile (selected for compile) [DEBUG] org.eclipse.jdt:core:jar:3.3.0:compile (selected for compile) [DEBUG] l2jfree:java-engine:jar:1.0.0:compile (selected for compile) [DEBUG] jython:jython:jar:2.2.1:compile (selected for compile) [DEBUG] l2jfree:jython-engine:jar:1.0.0:compile (selected for compile) [DEBUG] l2jfree:bsh-engine:jar:1.0.0:compile (selected for compile) [DEBUG] javax.management:jmxremote:jar:1.0.1_03-b57:compile (selected for compile) [DEBUG] javax.management:jmxremote_optional:jar:1.0.1_03-b57:compile (selected for compile) [DEBUG] javax.management:jmxri:jar:1.2.1-b14:compile (selected for compile) [DEBUG] jmxri:jmxtools:jar:1.2.8:compile (selected for compile) [DEBUG] org.schwering:irclib:jar:1.10:compile (selected for compile) [DEBUG] sshtools:j2ssh-daemon:jar:0.2.2:compile (selected for compile) [DEBUG] org.apache.maven.plugins:maven-compiler-plugin:maven-plugin:2.0.2:runtime (selected for runtime) [DEBUG] org.codehaus.plexus:plexus-utils:jar:1.0.4:runtime (selected for runtime) [DEBUG] Retrieving parent-POM: org.codehaus.plexus:plexus-compiler::1.5.3 for project: null:plexus-compiler-manager:jar:1.5.3 from the repository. [DEBUG] Retrieving parent-POM: org.codehaus.plexus:plexus-components::1.1.6 for project: null:plexus-compiler:pom:1.5.3 from the repository. [DEBUG] Retrieving parent-POM: org.codehaus.plexus:plexus::1.0.8 for project: org.codehaus.plexus:plexus-components:pom:1.1.6 from the repository. [DEBUG] org.codehaus.plexus:plexus-compiler-manager:jar:1.5.3:runtime (selected for runtime) [DEBUG] org.codehaus.plexus:plexus-container-default:jar:1.0-alpha-8:runtime (selected for runtime) [DEBUG] junit:junit:jar:3.8.1:runtime (selected for runtime) [DEBUG] classworlds:classworlds:jar:1.1-alpha-2:runtime (selected for runtime) [DEBUG] org.codehaus.plexus:plexus-compiler-api:jar:1.5.3:runtime (selected for runtime) [DEBUG] org.codehaus.plexus:plexus-compiler-api:jar:1.5.3:runtime (selected for runtime) [DEBUG] org.codehaus.plexus:plexus-utils:jar:1.1:runtime (removed - nearer found: 1.0.4) [DEBUG] Retrieving parent-POM: org.codehaus.plexus:plexus-compilers::1.5.3 for project: null:plexus-compiler-javac:jar:1.5.3 from the repository. [DEBUG] org.codehaus.plexus:plexus-compiler-javac:jar:1.5.3:runtime (selected for runtime) [DEBUG] org.codehaus.plexus:plexus-utils:jar:1.0.5:runtime (removed - nearer found: 1.0.4) [DEBUG] org.apache.maven:maven-artifact:jar:2.0:runtime (selected for runtime) [DEBUG] org.apache.maven:maven-plugin-api:jar:2.0:runtime (selected for runtime) [DEBUG] Configuring mojo 'org.apache.maven.plugins:maven-compiler-plugin:2.0.2:compile' --> [DEBUG] (f) basedir = /usr/la2server/inerlud/trunk/L2Emu_GameServer_CT1 [DEBUG] (f) buildDirectory = /usr/la2server/inerlud/trunk/L2Emu_GameServer_CT1/target [DEBUG] (f) classpathElements = [/usr/la2server/inerlud/trunk/L2Emu_GameServer_CT1/target/classes, /root/.m2/repository/l2jfree/l2j-commons/1.1.2/l2j-commons-1.1.2.jar, /root/.m2/repository/commons-logging/commons-logging/1.1/commons-logging-1.1.jar, /root/.m2/repository/log4j/log4j/1.2.14/log4j-1.2.14.jar, /root/.m2/repository/commons-lang/commons-lang/2.1/commons-lang-2.1.jar, /root/.m2/repository/org/apache/bsf/bsf/2.0/bsf-2.0.jar, /root/.m2/repository/commons-io/commons-io/1.2/commons-io-1.2.jar, /root/.m2/repository/org/hibernate/hibernate/3.2.2.ga/hibernate-3.2.2.ga.jar, /root/.m2/repository/net/sf/ehcache/ehcache/1.2.3/ehcache-1.2.3.jar, /root/.m2/repository/commons-collections/commons-collections/2.1.1/commons-collections-2.1.1.jar, /root/.m2/repository/javax/transaction/jta/1.0.1B/jta-1.0.1B.jar, /root/.m2/repository/asm/asm-attrs/1.5.3/asm-attrs-1.5.3.jar, /root/.m2/repository/dom4j/dom4j/1.6.1/dom4j-1.6.1.jar, /root/.m2/repository/antlr/antlr/2.7.6/antlr-2.7.6.jar, /root/.m2/repository/cglib/cglib/2.1_3/cglib-2.1_3.jar, /root/.m2/repository/asm/asm/1.5.3/asm-1.5.3.jar, /root/.m2/repository/c3p0/c3p0/0.9.1.2/c3p0-0.9.1.2.jar, /root/.m2/repository/javolution/javolution/1.5.4.2.6/javolution-1.5.4.2.6.jar, /root/.m2/repository/mysql/mysql-connector-java/5.1.5/mysql-connector-java-5.1.5.jar, /root/.m2/repository/org/springframework/spring/2.0.2/spring-2.0.2.jar, /root/.m2/repository/l2jfree/l2j-mmocore/1.0.6/l2j-mmocore-1.0.6.jar, /root/.m2/repository/org/beanshell/bsh/2.0b4/bsh-2.0b4.jar, /root/.m2/repository/org/eclipse/jdt/core/3.3.0/core-3.3.0.jar, /root/.m2/repository/l2jfree/java-engine/1.0.0/java-engine-1.0.0.jar, /root/.m2/repository/jython/jython/2.2.1/jython-2.2.1.jar, /root/.m2/repository/l2jfree/jython-engine/1.0.0/jython-engine-1.0.0.jar, /root/.m2/repository/l2jfree/bsh-engine/1.0.0/bsh-engine-1.0.0.jar, /root/.m2/repository/javax/management/jmxremote/1.0.1_03-b57/jmxremote-1.0.1_03-b57.jar, /root/.m2/repository/javax/management/jmxremote_optional/1.0.1_03-b57/jmxremote_optional-1.0.1_03-b57.jar, /root/.m2/repository/javax/management/jmxri/1.2.1-b14/jmxri-1.2.1-b14.jar, /root/.m2/repository/jmxri/jmxtools/1.2.8/jmxtools-1.2.8.jar, /root/.m2/repository/org/schwering/irclib/1.10/irclib-1.10.jar, /root/.m2/repository/sshtools/j2ssh-daemon/0.2.2/j2ssh-daemon-0.2.2.jar] [DEBUG] (f) compileSourceRoots = [/usr/la2server/inerlud/trunk/L2Emu_GameServer_CT1/src/main/java] [DEBUG] (f) compilerId = javac [DEBUG] (f) debug = true [DEBUG] (f) failOnError = true [DEBUG] (f) fork = false [DEBUG] (f) optimize = false [DEBUG] (f) outputDirectory = /usr/la2server/inerlud/trunk/L2Emu_GameServer_CT1/target/classes [DEBUG] (f) outputFileName = l2j-gameserver [DEBUG] (f) projectArtifact = L2Emu:l2j-gameserver:jar:1.0.0 [DEBUG] (f) showDeprecation = false [DEBUG] (f) showWarnings = false [DEBUG] (f) source = 1.5 [DEBUG] (f) staleMillis = 0 [DEBUG] (f) target = 1.5 [DEBUG] (f) verbose = false [DEBUG] -- end configuration -- [INFO] [compiler:compile] [DEBUG] Using compiler 'javac'. [DEBUG] Source directories: [/usr/la2server/inerlud/trunk/L2Emu_GameServer_CT1/src/main/java] [DEBUG] Classpath: [/usr/la2server/inerlud/trunk/L2Emu_GameServer_CT1/target/classes /root/.m2/repository/l2jfree/l2j-commons/1.1.2/l2j-commons-1.1.2.jar /root/.m2/repository/commons-logging/commons-logging/1.1/commons-logging-1.1.jar /root/.m2/repository/log4j/log4j/1.2.14/log4j-1.2.14.jar /root/.m2/repository/commons-lang/commons-lang/2.1/commons-lang-2.1.jar /root/.m2/repository/org/apache/bsf/bsf/2.0/bsf-2.0.jar /root/.m2/repository/commons-io/commons-io/1.2/commons-io-1.2.jar /root/.m2/repository/org/hibernate/hibernate/3.2.2.ga/hibernate-3.2.2.ga.jar /root/.m2/repository/net/sf/ehcache/ehcache/1.2.3/ehcache-1.2.3.jar /root/.m2/repository/commons-collections/commons-collections/2.1.1/commons-collections-2.1.1.jar /root/.m2/repository/javax/transaction/jta/1.0.1B/jta-1.0.1B.jar /root/.m2/repository/asm/asm-attrs/1.5.3/asm-attrs-1.5.3.jar /root/.m2/repository/dom4j/dom4j/1.6.1/dom4j-1.6.1.jar /root/.m2/repository/antlr/antlr/2.7.6/antlr-2.7.6.jar /root/.m2/repository/cglib/cglib/2.1_3/cglib-2.1_3.jar /root/.m2/repository/asm/asm/1.5.3/asm-1.5.3.jar /root/.m2/repository/c3p0/c3p0/0.9.1.2/c3p0-0.9.1.2.jar /root/.m2/repository/javolution/javolution/1.5.4.2.6/javolution-1.5.4.2.6.jar /root/.m2/repository/mysql/mysql-connector-java/5.1.5/mysql-connector-java-5.1.5.jar /root/.m2/repository/org/springframework/spring/2.0.2/spring-2.0.2.jar /root/.m2/repository/l2jfree/l2j-mmocore/1.0.6/l2j-mmocore-1.0.6.jar /root/.m2/repository/org/beanshell/bsh/2.0b4/bsh-2.0b4.jar /root/.m2/repository/org/eclipse/jdt/core/3.3.0/core-3.3.0.jar /root/.m2/repository/l2jfree/java-engine/1.0.0/java-engine-1.0.0.jar /root/.m2/repository/jython/jython/2.2.1/jython-2.2.1.jar /root/.m2/repository/l2jfree/jython-engine/1.0.0/jython-engine-1.0.0.jar /root/.m2/repository/l2jfree/bsh-engine/1.0.0/bsh-engine-1.0.0.jar /root/.m2/repository/javax/management/jmxremote/1.0.1_03-b57/jmxremote-1.0.1_03-b57.jar /root/.m2/repository/javax/management/jmxremote_optional/1.0.1_03-b57/jmxremote_optional-1.0.1_03-b57.jar /root/.m2/repository/javax/management/jmxri/1.2.1-b14/jmxri-1.2.1-b14.jar /root/.m2/repository/jmxri/jmxtools/1.2.8/jmxtools-1.2.8.jar /root/.m2/repository/org/schwering/irclib/1.10/irclib-1.10.jar /root/.m2/repository/sshtools/j2ssh-daemon/0.2.2/j2ssh-daemon-0.2.2.jar] [DEBUG] Output directory: /usr/la2server/inerlud/trunk/L2Emu_GameServer_CT1/target/classes [DEBUG] Classpath: [DEBUG] /usr/la2server/inerlud/trunk/L2Emu_GameServer_CT1/target/classes [DEBUG] /root/.m2/repository/l2jfree/l2j-commons/1.1.2/l2j-commons-1.1.2.jar [DEBUG] /root/.m2/repository/commons-logging/commons-logging/1.1/commons-logging-1.1.jar [DEBUG] /root/.m2/repository/log4j/log4j/1.2.14/log4j-1.2.14.jar [DEBUG] /root/.m2/repository/commons-lang/commons-lang/2.1/commons-lang-2.1.jar [DEBUG] /root/.m2/repository/org/apache/bsf/bsf/2.0/bsf-2.0.jar [DEBUG] /root/.m2/repository/commons-io/commons-io/1.2/commons-io-1.2.jar [DEBUG] /root/.m2/repository/org/hibernate/hibernate/3.2.2.ga/hibernate-3.2.2.ga.jar [DEBUG] /root/.m2/repository/net/sf/ehcache/ehcache/1.2.3/ehcache-1.2.3.jar [DEBUG] /root/.m2/repository/commons-collections/commons-collections/2.1.1/commons-collections-2.1.1.jar [DEBUG] /root/.m2/repository/javax/transaction/jta/1.0.1B/jta-1.0.1B.jar [DEBUG] /root/.m2/repository/asm/asm-attrs/1.5.3/asm-attrs-1.5.3.jar [DEBUG] /root/.m2/repository/dom4j/dom4j/1.6.1/dom4j-1.6.1.jar [DEBUG] /root/.m2/repository/antlr/antlr/2.7.6/antlr-2.7.6.jar [DEBUG] /root/.m2/repository/cglib/cglib/2.1_3/cglib-2.1_3.jar [DEBUG] /root/.m2/repository/asm/asm/1.5.3/asm-1.5.3.jar [DEBUG] /root/.m2/repository/c3p0/c3p0/0.9.1.2/c3p0-0.9.1.2.jar [DEBUG] /root/.m2/repository/javolution/javolution/1.5.4.2.6/javolution-1.5.4.2.6.jar [DEBUG] /root/.m2/repository/mysql/mysql-connector-java/5.1.5/mysql-connector-java-5.1.5.jar [DEBUG] /root/.m2/repository/org/springframework/spring/2.0.2/spring-2.0.2.jar [DEBUG] /root/.m2/repository/l2jfree/l2j-mmocore/1.0.6/l2j-mmocore-1.0.6.jar [DEBUG] /root/.m2/repository/org/beanshell/bsh/2.0b4/bsh-2.0b4.jar [DEBUG] /root/.m2/repository/org/eclipse/jdt/core/3.3.0/core-3.3.0.jar [DEBUG] /root/.m2/repository/l2jfree/java-engine/1.0.0/java-engine-1.0.0.jar [DEBUG] /root/.m2/repository/jython/jython/2.2.1/jython-2.2.1.jar [DEBUG] /root/.m2/repository/l2jfree/jython-engine/1.0.0/jython-engine-1.0.0.jar [DEBUG] /root/.m2/repository/l2jfree/bsh-engine/1.0.0/bsh-engine-1.0.0.jar [DEBUG] /root/.m2/repository/javax/management/jmxremote/1.0.1_03-b57/jmxremote-1.0.1_03-b57.jar [DEBUG] /root/.m2/repository/javax/management/jmxremote_optional/1.0.1_03-b57/jmxremote_optional-1.0.1_03-b57.jar [DEBUG] /root/.m2/repository/javax/management/jmxri/1.2.1-b14/jmxri-1.2.1-b14.jar [DEBUG] /root/.m2/repository/jmxri/jmxtools/1.2.8/jmxtools-1.2.8.jar [DEBUG] /root/.m2/repository/org/schwering/irclib/1.10/irclib-1.10.jar [DEBUG] /root/.m2/repository/sshtools/j2ssh-daemon/0.2.2/j2ssh-daemon-0.2.2.jar [DEBUG] Source roots: [DEBUG] /usr/la2server/inerlud/trunk/L2Emu_GameServer_CT1/src/main/java [INFO] Compiling 1418 source files to /usr/la2server/inerlud/trunk/L2Emu_GameServer_CT1/target/classes [INFO] ------------------------------------------------------------------------ [ERROR] BUILD FAILURE [INFO] ------------------------------------------------------------------------ [INFO] Compilation failure /usr/la2server/inerlud/trunk/L2Emu_GameServer_CT1/src/main/java/net/sf/l2j/gameserver/scripting/ManagedScript.java:[20,20] package javax.script does not exist /usr/la2server/inerlud/trunk/L2Emu_GameServer_CT1/src/main/java/net/sf/l2j/gameserver/scripting/L2ScriptEngineManager.java:[30,20] package javax.script does not exist /usr/la2server/inerlud/trunk/L2Emu_GameServer_CT1/src/main/java/net/sf/l2j/gameserver/scripting/L2ScriptEngineManager.java:[31,20] package javax.script does not exist /usr/la2server/inerlud/trunk/L2Emu_GameServer_CT1/src/main/java/net/sf/l2j/gameserver/scripting/L2ScriptEngineManager.java:[32,20] package javax.script does not exist /usr/la2server/inerlud/trunk/L2Emu_GameServer_CT1/src/main/java/net/sf/l2j/gameserver/scripting/L2ScriptEngineManager.java:[33,20] package javax.script does not exist /usr/la2server/inerlud/trunk/L2Emu_GameServer_CT1/src/main/java/net/sf/l2j/gameserver/scripting/L2ScriptEngineManager.java:[34,20] package javax.script does not exist /usr/la2server/inerlud/trunk/L2Emu_GameServer_CT1/src/main/java/net/sf/l2j/gameserver/scripting/L2ScriptEngineManager.java:[35,20] package javax.script does not exist /usr/la2server/inerlud/trunk/L2Emu_GameServer_CT1/src/main/java/net/sf/l2j/gameserver/scripting/L2ScriptEngineManager.java:[36,20] package javax.script does not exist /usr/la2server/inerlud/trunk/L2Emu_GameServer_CT1/src/main/java/net/sf/l2j/gameserver/scripting/L2ScriptEngineManager.java:[37,20] package javax.script does not exist /usr/la2server/inerlud/trunk/L2Emu_GameServer_CT1/src/main/java/net/sf/l2j/gameserver/scripting/L2ScriptEngineManager.java:[67,30] cannot find symbol symbol : class ScriptEngine location: class net.sf.l2j.gameserver.scripting.L2ScriptEngineManager /usr/la2server/inerlud/trunk/L2Emu_GameServer_CT1/src/main/java/net/sf/l2j/gameserver/scripting/L2ScriptEngineManager.java:[68,30] cannot find symbol symbol : class ScriptEngine location: class net.sf.l2j.gameserver.scripting.L2ScriptEngineManager /usr/la2server/inerlud/trunk/L2Emu_GameServer_CT1/src/main/java/net/sf/l2j/gameserver/scripting/L2ScriptEngineManager.java:[146,12] cannot find symbol symbol : class ScriptEngine location: class net.sf.l2j.gameserver.scripting.L2ScriptEngineManager /usr/la2server/inerlud/trunk/L2Emu_GameServer_CT1/src/main/java/net/sf/l2j/gameserver/scripting/L2ScriptEngineManager.java:[151,12] cannot find symbol symbol : class ScriptEngine location: class net.sf.l2j.gameserver.scripting.L2ScriptEngineManager /usr/la2server/inerlud/trunk/L2Emu_GameServer_CT1/src/main/java/net/sf/l2j/gameserver/scripting/L2ScriptEngineManager.java:[275,48] cannot find symbol symbol : class ScriptException location: class net.sf.l2j.gameserver.scripting.L2ScriptEngineManager /usr/la2server/inerlud/trunk/L2Emu_GameServer_CT1/src/main/java/net/sf/l2j/gameserver/scripting/L2ScriptEngineManager.java:[300,90] cannot find symbol symbol : class ScriptException location: class net.sf.l2j.gameserver.scripting.L2ScriptEngineManager /usr/la2server/inerlud/trunk/L2Emu_GameServer_CT1/src/main/java/net/sf/l2j/gameserver/scripting/L2ScriptEngineManager.java:[313,30] cannot find symbol symbol : class ScriptEngine location: class net.sf.l2j.gameserver.scripting.L2ScriptEngineManager /usr/la2server/inerlud/trunk/L2Emu_GameServer_CT1/src/main/java/net/sf/l2j/gameserver/scripting/L2ScriptEngineManager.java:[313,92] cannot find symbol symbol : class ScriptException location: class net.sf.l2j.gameserver.scripting.L2ScriptEngineManager /usr/la2server/inerlud/trunk/L2Emu_GameServer_CT1/src/main/java/net/sf/l2j/gameserver/scripting/L2ScriptEngineManager.java:[313,16] executeScript(java.lang.String,java.io.File) is already defined in net.sf.l2j.gameserver.scripting.L2ScriptEngineManager /usr/la2server/inerlud/trunk/L2Emu_GameServer_CT1/src/main/java/net/sf/l2j/gameserver/scripting/L2ScriptEngineManager.java:[388,42] cannot find symbol symbol : class ScriptEngine location: class net.sf.l2j.gameserver.scripting.L2ScriptEngineManager /usr/la2server/inerlud/trunk/L2Emu_GameServer_CT1/src/main/java/net/sf/l2j/gameserver/scripting/L2ScriptEngineManager.java:[388,11] cannot find symbol symbol : class ScriptContext location: class net.sf.l2j.gameserver.scripting.L2ScriptEngineManager /usr/la2server/inerlud/trunk/L2Emu_GameServer_CT1/src/main/java/net/sf/l2j/gameserver/scripting/L2ScriptEngineManager.java:[393,11] cannot find symbol symbol : class ScriptContext location: class net.sf.l2j.gameserver.scripting.L2ScriptEngineManager /usr/la2server/inerlud/trunk/L2Emu_GameServer_CT1/src/main/java/net/sf/l2j/gameserver/scripting/L2ScriptEngineManager.java:[406,23] cannot find symbol symbol : class ScriptEngine location: class net.sf.l2j.gameserver.scripting.L2ScriptEngineManager /usr/la2server/inerlud/trunk/L2Emu_GameServer_CT1/src/main/java/net/sf/l2j/gameserver/scripting/L2ScriptEngineManager.java:[406,59] cannot find symbol symbol : class ScriptContext location: class net.sf.l2j.gameserver.scripting.L2ScriptEngineManager /usr/la2server/inerlud/trunk/L2Emu_GameServer_CT1/src/main/java/net/sf/l2j/gameserver/scripting/L2ScriptEngineManager.java:[406,89] cannot find symbol symbol : class ScriptException location: class net.sf.l2j.gameserver.scripting.L2ScriptEngineManager /usr/la2server/inerlud/trunk/L2Emu_GameServer_CT1/src/main/java/net/sf/l2j/gameserver/scripting/L2ScriptEngineManager.java:[420,64] cannot find symbol symbol : class ScriptException location: class net.sf.l2j.gameserver.scripting.L2ScriptEngineManager /usr/la2server/inerlud/trunk/L2Emu_GameServer_CT1/src/main/java/net/sf/l2j/gameserver/scripting/L2ScriptEngineManager.java:[425,57] cannot find symbol symbol : class ScriptContext location: class net.sf.l2j.gameserver.scripting.L2ScriptEngineManager /usr/la2server/inerlud/trunk/L2Emu_GameServer_CT1/src/main/java/net/sf/l2j/gameserver/scripting/L2ScriptEngineManager.java:[425,87] cannot find symbol symbol : class ScriptException location: class net.sf.l2j.gameserver.scripting.L2ScriptEngineManager /usr/la2server/inerlud/trunk/L2Emu_GameServer_CT1/src/main/java/net/sf/l2j/gameserver/scripting/L2ScriptEngineManager.java:[438,23] cannot find symbol symbol : class ScriptEngine location: class net.sf.l2j.gameserver.scripting.L2ScriptEngineManager /usr/la2server/inerlud/trunk/L2Emu_GameServer_CT1/src/main/java/net/sf/l2j/gameserver/scripting/L2ScriptEngineManager.java:[438,66] cannot find symbol symbol : class ScriptException location: class net.sf.l2j.gameserver.scripting.L2ScriptEngineManager /usr/la2server/inerlud/trunk/L2Emu_GameServer_CT1/src/main/java/net/sf/l2j/gameserver/scripting/L2ScriptEngineManager.java:[438,18] eval(java.lang.String,java.lang.String) is already defined in net.sf.l2j.gameserver.scripting.L2ScriptEngineManager /usr/la2server/inerlud/trunk/L2Emu_GameServer_CT1/src/main/java/net/sf/l2j/gameserver/scripting/L2ScriptEngineManager.java:[443,51] cannot find symbol symbol : class ScriptException location: class net.sf.l2j.gameserver.scripting.L2ScriptEngineManager [INFO] ------------------------------------------------------------------------ [DEBUG] Trace org.apache.maven.BuildFailureException: Compilation failure at org.apache.maven.lifecycle.DefaultLifecycleExecutor.executeGoals(DefaultLifecycleExecutor.java:560) at org.apache.maven.lifecycle.DefaultLifecycleExecutor.executeGoalWithLifecycle(DefaultLifecycleExecutor.java:480) at org.apache.maven.lifecycle.DefaultLifecycleExecutor.forkProjectLifecycle(DefaultLifecycleExecutor.java:896) at org.apache.maven.lifecycle.DefaultLifecycleExecutor.forkLifecycle(DefaultLifecycleExecutor.java:734) at org.apache.maven.lifecycle.DefaultLifecycleExecutor.executeGoals(DefaultLifecycleExecutor.java:510) at org.apache.maven.lifecycle.DefaultLifecycleExecutor.executeStandaloneGoal(DefaultLifecycleExecutor.java:493) at org.apache.maven.lifecycle.DefaultLifecycleExecutor.executeGoal(DefaultLifecycleExecutor.java:463) at org.apache.maven.lifecycle.DefaultLifecycleExecutor.executeGoalAndHandleFailures(DefaultLifecycleExecutor.java:311) at org.apache.maven.lifecycle.DefaultLifecycleExecutor.executeTaskSegments(DefaultLifecycleExecutor.java:224) at org.apache.maven.lifecycle.DefaultLifecycleExecutor.execute(DefaultLifecycleExecutor.java:143) at org.apache.maven.DefaultMaven.doExecute(DefaultMaven.java:333) at org.apache.maven.DefaultMaven.execute(DefaultMaven.java:126) at org.apache.maven.cli.MavenCli.main(MavenCli.java:282) at sun.reflect.NativeMethodAccessorImpl.invoke0(Native Method) at sun.reflect.NativeMethodAccessorImpl.invoke(NativeMethodAccessorImpl.java:39) at sun.reflect.DelegatingMethodAccessorImpl.invoke(DelegatingMethodAccessorImpl.java:25) at java.lang.reflect.Method.invoke(Method.java:585) at org.codehaus.classworlds.Launcher.launchEnhanced(Launcher.java:315) at org.codehaus.classworlds.Launcher.launch(Launcher.java:255) at org.codehaus.classworlds.Launcher.mainWithExitCode(Launcher.java:430) at org.codehaus.classworlds.Launcher.main(Launcher.java:375) Caused by: org.apache.maven.plugin.CompilationFailureException: Compilation failure at org.apache.maven.plugin.AbstractCompilerMojo.execute(AbstractCompilerMojo.java:516) at org.apache.maven.plugin.CompilerMojo.execute(CompilerMojo.java:114) at org.apache.maven.plugin.DefaultPluginManager.executeMojo(DefaultPluginManager.java:447) at org.apache.maven.lifecycle.DefaultLifecycleExecutor.executeGoals(DefaultLifecycleExecutor.java:539) ... 20 more [INFO] ------------------------------------------------------------------------ [INFO] Total time: 12 seconds [INFO] Finished at: Mon Feb 18 15:08:44 MSK 2008 [INFO] Final Memory: 15M/63M [INFO] ------------------------------------------------------------------------ где что не так скажите плс... |
|||
|
||||
![]()
|
| Правила форума "Java" | |
|
|
Если Вам помогли, и атмосфера форума Вам понравилась, то заходите к нам чаще! С уважением, LSD, AntonSaburov, powerOn, tux, javastic. |
| 0 Пользователей читают эту тему (0 Гостей и 0 Скрытых Пользователей) | |
| 0 Пользователей: | |
| « Предыдущая тема | Java: Общие вопросы | Следующая тема » |
|
|
По вопросам размещения рекламы пишите на vladimir(sobaka)vingrad.ru
Отказ от ответственности Powered by Invision Power Board(R) 1.3 © 2003 IPS, Inc. |