Модераторы: LSD, AntonSaburov
  

Поиск:

Ответ в темуСоздание новой темы Создание опроса
> glassfish-embedded + junit = отказано в доступе 
:(
    Опции темы
zhz
Дата 17.12.2012, 09:05 (ссылка) | (нет голосов) Загрузка ... Загрузка ... Быстрая цитата Цитата


Шустрый
*


Профиль
Группа: Участник
Сообщений: 76
Регистрация: 31.10.2006
Где: Petropavlovsk-Kam chatsky

Репутация: нет
Всего: 2



при выполнении mvn test вываливается следующее:

Код




C:\Users\hz>cd chapter06

C:\Users\hz\chapter06>mvn test
[INFO] Scanning for projects...
[WARNING]
[WARNING] Some problems were encountered while building the effective model for Chapeter06:chapter06:jar:1.0
[WARNING] 'build.plugins.plugin.version' for org.apache.maven.plugins:maven-compiler-plugin is missing. @ line 137, column 37
[WARNING]
[WARNING] It is highly recommended to fix these problems because they threaten the stability of your build.
[WARNING]
[WARNING] For this reason, future Maven versions might no longer support building such malformed projects.
[WARNING]
[INFO]
[INFO] ------------------------------------------------------------------------
[INFO] Building chapter 06 application 1.0
[INFO] ------------------------------------------------------------------------
[INFO]
[INFO] --- maven-resources-plugin:2.5:resources (default-resources) @ chapter06 ---
[debug] execute contextualize
[WARNING] Using platform encoding (Cp1251 actually) to copy filtered resources, i.e. build is platform dependent!
[INFO] Copying 1 resource
[INFO]
[INFO] --- maven-compiler-plugin:2.3.2:compile (default-compile) @ chapter06 ---
[INFO] Nothing to compile - all classes are up to date
[INFO]
[INFO] --- maven-resources-plugin:2.5:testResources (default-testResources) @ chapter06 ---
[debug] execute contextualize
[WARNING] Using platform encoding (Cp1251 actually) to copy filtered resources, i.e. build is platform dependent!
[INFO] Copying 0 resource
[INFO]
[INFO] --- maven-compiler-plugin:2.3.2:testCompile (default-testCompile) @ chapter06 ---
[INFO] Nothing to compile - all classes are up to date
[INFO]
[INFO] --- maven-surefire-plugin:2.10:test (default-test) @ chapter06 ---
[INFO] Surefire report directory: C:\Users\hz\chapter06\target\surefire-reports

-------------------------------------------------------
 T E S T S
-------------------------------------------------------
Running BookEJBTest
фхъ 17, 2012 10:01:30 AM org.glassfish.ejb.embedded.EJBContainerProviderImpl getValidFile
SEVERE: EJB6004:Specified application server installation location [C:\Users\hz\.m2\repository\org\glassfish\extras\glassfish-embedded-all\domains\domain1] does not exist.
фхъ 17, 2012 10:01:31 AM com.sun.enterprise.v3.services.impl.GrizzlyService createNetworkProxy
INFO: Network listener http-listener on port 0 disabled per domain.xml
фхъ 17, 2012 10:01:31 AM com.sun.enterprise.v3.services.impl.GrizzlyService createNetworkProxy
INFO: Network listener https-listener on port 0 disabled per domain.xml
фхъ 17, 2012 10:01:31 AM com.sun.enterprise.v3.server.AppServerStartup run
INFO: GlassFish Server Open Source Edition 3.1.1 (12) startup time : Embedded (411ms), startup services(244ms), total(655ms)
фхъ 17, 2012 10:01:31 AM org.glassfish.admin.mbeanserver.JMXStartupService$JMXConnectorsStarterThread run
INFO: JMXStartupService: JMXConnector system is disabled, skipping.
фхъ 17, 2012 10:01:32 AM org.glassfish.ejb.embedded.EJBContainerProviderImpl skipJar
INFO: ... skipping entry with a Manifest file with a special attribute: javax.ejb-3.1.1.jar
фхъ 17, 2012 10:01:32 AM org.glassfish.ejb.embedded.EJBContainerProviderImpl skipJar
INFO: ... skipping entry with a Manifest file with a special attribute: javax.transaction-3.1.1.jar
фхъ 17, 2012 10:01:32 AM org.glassfish.ejb.embedded.EJBContainerProviderImpl skipJar
INFO: ... skipping entry with a Manifest file with a special attribute: javax.annotation-3.1.1.jar
фхъ 17, 2012 10:01:32 AM org.glassfish.ejb.embedded.EJBContainerProviderImpl skipJar
INFO: ... skipping entry with a Manifest file with a special attribute: glassfish-embedded-all-3.1.1.jar
фхъ 17, 2012 10:01:32 AM org.glassfish.ejb.embedded.DeploymentElement getOrCreateApplication
INFO: [DeploymentElement] adding EJB module to ScatteredArchive classes
фхъ 17, 2012 10:01:32 AM org.glassfish.ejb.embedded.DeploymentElement getOrCreateApplication
INFO: [DeploymentElement] adding library to ScatteredArchive javassist-3.12.0.GA.jar
фхъ 17, 2012 10:01:32 AM org.glassfish.ejb.embedded.DeploymentElement getOrCreateApplication
INFO: [DeploymentElement] adding library to ScatteredArchive hibernate-entitymanager-3.5.4-Final.jar
фхъ 17, 2012 10:01:32 AM org.glassfish.ejb.embedded.DeploymentElement getOrCreateApplication
INFO: [DeploymentElement] adding library to ScatteredArchive xml-apis-1.0.b2.jar
фхъ 17, 2012 10:01:32 AM org.glassfish.ejb.embedded.DeploymentElement getOrCreateApplication
INFO: [DeploymentElement] adding library to ScatteredArchive slf4j-nop-1.6.4.jar
фхъ 17, 2012 10:01:32 AM org.glassfish.ejb.embedded.DeploymentElement getOrCreateApplication
INFO: [DeploymentElement] adding library to ScatteredArchive dom4j-1.6.1.jar
фхъ 17, 2012 10:01:32 AM org.glassfish.ejb.embedded.DeploymentElement getOrCreateApplication
INFO: [DeploymentElement] adding library to ScatteredArchive test-classes
фхъ 17, 2012 10:01:32 AM org.glassfish.ejb.embedded.DeploymentElement getOrCreateApplication
INFO: [DeploymentElement] adding library to ScatteredArchive junit-4.10.jar
фхъ 17, 2012 10:01:32 AM org.glassfish.ejb.embedded.DeploymentElement getOrCreateApplication
INFO: [DeploymentElement] adding library to ScatteredArchive slf4j-api-1.6.4.jar
фхъ 17, 2012 10:01:32 AM org.glassfish.ejb.embedded.DeploymentElement getOrCreateApplication
INFO: [DeploymentElement] adding library to ScatteredArchive asm-3.1.jar
фхъ 17, 2012 10:01:32 AM org.glassfish.ejb.embedded.DeploymentElement getOrCreateApplication
INFO: [DeploymentElement] adding library to ScatteredArchive hibernate-core-3.5.4-Final.jar
фхъ 17, 2012 10:01:32 AM org.glassfish.ejb.embedded.DeploymentElement getOrCreateApplication
INFO: [DeploymentElement] adding library to ScatteredArchive jsf-api-2.0.jar
фхъ 17, 2012 10:01:32 AM org.glassfish.ejb.embedded.DeploymentElement getOrCreateApplication
INFO: [DeploymentElement] adding library to ScatteredArchive jta-1.1.jar
фхъ 17, 2012 10:01:32 AM org.glassfish.ejb.embedded.DeploymentElement getOrCreateApplication
INFO: [DeploymentElement] adding library to ScatteredArchive hibernate-annotations-3.5.4-Final.jar
фхъ 17, 2012 10:01:32 AM org.glassfish.ejb.embedded.DeploymentElement getOrCreateApplication
INFO: [DeploymentElement] adding library to ScatteredArchive antlr-2.7.6.jar
фхъ 17, 2012 10:01:32 AM org.glassfish.ejb.embedded.DeploymentElement getOrCreateApplication
INFO: [DeploymentElement] adding library to ScatteredArchive aopalliance-1.0.jar
фхъ 17, 2012 10:01:32 AM org.glassfish.ejb.embedded.DeploymentElement getOrCreateApplication
INFO: [DeploymentElement] adding library to ScatteredArchive cglib-2.2.jar
фхъ 17, 2012 10:01:32 AM org.glassfish.ejb.embedded.DeploymentElement getOrCreateApplication
INFO: [DeploymentElement] adding library to ScatteredArchive slf4j-simple-1.6.4.jar
фхъ 17, 2012 10:01:32 AM org.glassfish.ejb.embedded.DeploymentElement getOrCreateApplication
INFO: [DeploymentElement] adding library to ScatteredArchive commons-collections-3.1.jar
фхъ 17, 2012 10:01:32 AM org.glassfish.ejb.embedded.DeploymentElement getOrCreateApplication
INFO: [DeploymentElement] adding library to ScatteredArchive hibernate-jpa-2.0-api-1.0.1.Final.jar
фхъ 17, 2012 10:01:32 AM org.glassfish.ejb.embedded.DeploymentElement getOrCreateApplication
INFO: [DeploymentElement] adding library to ScatteredArchive hibernate-commons-annotations-3.2.0.Final.jar
фхъ 17, 2012 10:01:32 AM org.glassfish.ejb.embedded.DeploymentElement getOrCreateApplication
INFO: [DeploymentElement] adding library to ScatteredArchive hamcrest-core-1.1.jar
фхъ 17, 2012 10:01:32 AM org.glassfish.ejb.embedded.EJBContainerImpl deploy
INFO: [EJBContainerImpl] Deploying app: org.glassfish.embeddable.archive.ScatteredArchive@1dac188
фхъ 17, 2012 10:01:39 AM com.sun.enterprise.v3.server.ApplicationLifecycle getContext
SEVERE: Error while expanding archive file
java.io.FileNotFoundException: Z:\systemp\gfembed5049392026480991815tmp\applications\classes\LICENSE (отказано в доступе)
        at java.io.FileOutputStream.open(Native Method)
        at java.io.FileOutputStream.<init>(FileOutputStream.java:212)
        at java.io.FileOutputStream.<init>(FileOutputStream.java:165)
        at com.sun.enterprise.deploy.shared.FileArchive.putNextEntry(FileArchive.java:668)
        at org.glassfish.internal.deployment.GenericHandler.expand(GenericHandler.java:91)
        at com.sun.enterprise.v3.server.ApplicationLifecycle.getContext(ApplicationLifecycle.java:1623)
        at com.sun.enterprise.v3.server.ApplicationLifecycle.access$200(ApplicationLifecycle.java:121)
        at com.sun.enterprise.v3.server.ApplicationLifecycle$DeploymentContextBuidlerImpl.build(ApplicationLifecycle.java:1490)
        at org.glassfish.deployment.admin.DeployCommand.execute(DeployCommand.java:318)
        at com.sun.enterprise.v3.admin.CommandRunnerImpl$1.execute(CommandRunnerImpl.java:355)
        at com.sun.enterprise.v3.admin.CommandRunnerImpl.doCommand(CommandRunnerImpl.java:370)
        at com.sun.enterprise.v3.admin.CommandRunnerImpl.doCommand(CommandRunnerImpl.java:1064)
        at com.sun.enterprise.v3.admin.CommandRunnerImpl.access$1200(CommandRunnerImpl.java:96)
        at com.sun.enterprise.v3.admin.CommandRunnerImpl$ExecutionContext.execute(CommandRunnerImpl.java:1244)
        at com.sun.enterprise.v3.admin.CommandRunnerImpl$ExecutionContext.execute(CommandRunnerImpl.java:1232)
        at com.sun.enterprise.admin.cli.embeddable.DeployerImpl.deploy(DeployerImpl.java:129)
        at com.sun.enterprise.admin.cli.embeddable.DeployerImpl.deploy(DeployerImpl.java:105)
        at org.glassfish.ejb.embedded.EJBContainerImpl.deploy(EJBContainerImpl.java:140)
        at org.glassfish.ejb.embedded.EJBContainerProviderImpl.createEJBContainer(EJBContainerProviderImpl.java:134)
        at javax.ejb.embeddable.EJBContainer.createEJBContainer(EJBContainer.java:127)
        at javax.ejb.embeddable.EJBContainer.createEJBContainer(EJBContainer.java:102)
        at BookEJBTest.initContainer(BookEJBTest.java:25)
        at sun.reflect.NativeMethodAccessorImpl.invoke0(Native Method)
        at sun.reflect.NativeMethodAccessorImpl.invoke(NativeMethodAccessorImpl.java:57)
        at sun.reflect.DelegatingMethodAccessorImpl.invoke(DelegatingMethodAccessorImpl.java:43)
        at java.lang.reflect.Method.invoke(Method.java:601)
        at org.junit.runners.model.FrameworkMethod$1.runReflectiveCall(FrameworkMethod.java:45)
        at org.junit.internal.runners.model.ReflectiveCallable.run(ReflectiveCallable.java:15)
        at org.junit.runners.model.FrameworkMethod.invokeExplosively(FrameworkMethod.java:42)
        at org.junit.internal.runners.statements.RunBefores.evaluate(RunBefores.java:27)
        at org.junit.internal.runners.statements.RunAfters.evaluate(RunAfters.java:30)
        at org.junit.runners.ParentRunner.run(ParentRunner.java:300)
        at org.apache.maven.surefire.junit4.JUnit4TestSet.execute(JUnit4TestSet.java:53)
        at org.apache.maven.surefire.junit4.JUnit4Provider.executeTestSet(JUnit4Provider.java:123)
        at org.apache.maven.surefire.junit4.JUnit4Provider.invoke(JUnit4Provider.java:104)
        at sun.reflect.NativeMethodAccessorImpl.invoke0(Native Method)
        at sun.reflect.NativeMethodAccessorImpl.invoke(NativeMethodAccessorImpl.java:57)
        at sun.reflect.DelegatingMethodAccessorImpl.invoke(DelegatingMethodAccessorImpl.java:43)
        at java.lang.reflect.Method.invoke(Method.java:601)
        at org.apache.maven.surefire.util.ReflectionUtils.invokeMethodWithArray(ReflectionUtils.java:164)
        at org.apache.maven.surefire.booter.ProviderFactory$ProviderProxy.invoke(ProviderFactory.java:110)
        at org.apache.maven.surefire.booter.SurefireStarter.invokeProvider(SurefireStarter.java:175)
        at org.apache.maven.surefire.booter.SurefireStarter.runSuitesInProcessWhenForked(SurefireStarter.java:107)
        at org.apache.maven.surefire.booter.ForkedBooter.main(ForkedBooter.java:68)

фхъ 17, 2012 10:01:39 AM org.glassfish.deployment.admin.DeployCommand execute
SEVERE: Z:\systemp\gfembed5049392026480991815tmp\applications\classes\LICENSE (отказано в доступе)
PlainTextActionReporterFAILUREDescription: deploy AdminCommandError occurred during deployment: Z:\systemp\gfembed5049392026480991815tmp\applications\classes\LICENSE (отказано в доступе. Please see s
erver.log for more details.
    [name=classes
фхъ 17, 2012 10:01:41 AM org.glassfish.ejb.embedded.EJBContainerProviderImpl createEJBContainer
INFO: [EJBContainerProviderImpl] Cleaning up on failure ...
фхъ 17, 2012 10:01:41 AM org.glassfish.admin.mbeanserver.JMXStartupService shutdown
INFO: JMXStartupService and JMXConnectors have been shut down.
фхъ 17, 2012 10:01:41 AM com.sun.enterprise.v3.server.AppServerStartup stop
INFO: Shutdown procedure finished
фхъ 17, 2012 10:01:41 AM AppServerStartup run
INFO: [Thread[GlassFish Kernel Main Thread,5,main]] exiting
Tests run: 2, Failures: 0, Errors: 2, Skipped: 0, Time elapsed: 11.065 sec <<< FAILURE!

Results :

Tests in error:
  BookEJBTest: Failed to deploy EJB modules - see log for details
  BookEJBTest

Tests run: 2, Failures: 0, Errors: 2, Skipped: 0

[INFO] ------------------------------------------------------------------------
[INFO] BUILD FAILURE
[INFO] ------------------------------------------------------------------------
[INFO] Total time: 12.283s
[INFO] Finished at: Mon Dec 17 10:01:41 MSK 2012
[INFO] Final Memory: 5M/15M
[INFO] ------------------------------------------------------------------------
[ERROR] Failed to execute goal org.apache.maven.plugins:maven-surefire-plugin:2.10:test (default-test) on project chapter06: There are test failures.
[ERROR]
[ERROR] Please refer to C:\Users\hz\chapter06\target\surefire-reports for the individual test results.
[ERROR] -> [Help 1]
[ERROR]
[ERROR] To see the full stack trace of the errors, re-run Maven with the -e switch.
[ERROR] Re-run Maven using the -X switch to enable full debug logging.
[ERROR]
[ERROR] For more information about the errors and possible solutions, please read the following articles:
[ERROR] [Help 1] http://cwiki.apache.org/confluence/display/MAVEN/MojoFailureException

все хозяйство работает на win7 Как это побороть?
уже поменял TEMP, не помогло..

При тесте из IntelliJIdea
Добавлено @ 09:15
PlainTextActionReporterFAILUREDescription: deploy AdminCommandError occurred during deployment: Z:\systemp\gfembed1998796141030794525tmp\applications\classes\license\LICENSE.dom-documentation.txt (Системе не удается найти указанный путь). Please see server.log for more details.
    [name=classes
дек 17, 2012 10:13:32 AM org.glassfish.ejb.embedded.EJBContainerProviderImpl createEJBContainer
INFO: [EJBContainerProviderImpl] Cleaning up on failure ...
дек 17, 2012 10:13:32 AM org.glassfish.admin.mbeanserver.JMXStartupService shutdown
INFO: JMXStartupService and JMXConnectors have been shut down.
дек 17, 2012 10:13:32 AM com.sun.enterprise.v3.server.AppServerStartup stop
INFO: Shutdown procedure finished
дек 17, 2012 10:13:32 AM AppServerStartup run
INFO: [Thread[GlassFish Kernel Main Thread,5,main]] exiting

Process finished with exit code -1

Это сообщение отредактировал(а) zhz - 17.12.2012, 09:16
PM MAIL ICQ   Вверх
  
Ответ в темуСоздание новой темы Создание опроса
Правила форума "Java"
LSD   AntonSaburov
powerOn   tux
  • Прежде, чем задать вопрос, прочтите это!
  • Книги по Java собираются здесь.
  • Документация и ресурсы по Java находятся здесь.
  • Используйте теги [code=java][/code] для подсветки кода. Используйтe чекбокс "транслит", если у Вас нет русских шрифтов.
  • Помечайте свой вопрос как решённый, если на него получен ответ. Ссылка "Пометить как решённый" находится над первым постом.
  • Действия модераторов можно обсудить здесь.
  • FAQ раздела лежит здесь.

Если Вам помогли, и атмосфера форума Вам понравилась, то заходите к нам чаще! С уважением, LSD, AntonSaburov, powerOn, tux.

 
0 Пользователей читают эту тему (0 Гостей и 0 Скрытых Пользователей)
0 Пользователей:
« Предыдущая тема | Java EE (J2EE) и Spring | Следующая тема »


 




[ Время генерации скрипта: 0.0395 ]   [ Использовано запросов: 22 ]   [ GZIP включён ]


Реклама на сайте     Информационное спонсорство

 
По вопросам размещения рекламы пишите на vladimir(sobaka)vingrad.ru
Отказ от ответственности     Powered by Invision Power Board(R) 1.3 © 2003  IPS, Inc.